{"text_format":"1","workbook":"xlsx","n_sheets":7,"sheets":["Accueil","Données","STATS CP","STATS RTT ","Saisies","Personnel","Feuil1"],"not_rendered":{"charts":0,"images":0,"macros":1,"external_links":0,"defined_names":27,"comments":2,"pivot_tables":3},"unopened":[],"bounds":{"document_bytes":16777216,"sheet_cells":100000,"rows_first":2000,"rows_last":500,"rows_between":2000,"halvings":0,"cell_chars":16384,"cell_head_chars":4096},"cells_cut":0,"cells_raw":0,"read":"whole","date_system":"1900"}

{"sheet":"Accueil","index":0,"n_rows":21,"n_cols":32,"rows_kept":21,"cut":false,"hidden":false,"merged":[[3,23,3,25],[11,26,12,26],[11,27,12,27],[11,20,12,21],[11,22,12,24],[11,25,12,25],[5,20,5,21],[7,20,7,21],[4,20,4,27],[6,20,6,27],[5,24,5,25],[5,22,5,23],[9,20,9,21],[7,25,7,26],[9,25,9,26],[3,26,3,27],[15,20,15,21],[16,20,16,21],[1,2,1,4],[2,2,2,4],[3,1,3,5],[3,20,3,22]]}
[]
[null,{"$f":"TODAY()","v":"2016-01-25"},"g.bearzatto",null,null,null,null,null,"Salarié","NATURE","Formule"]
[null,"Bonjour   ",{"$f":"INDEX(Personnel!$A$4:$C$51,MATCH($C$2,Personnel!$C$4:$C$51,0),1)","v":"BEARZATTO Giovanni"},{"$f":"INDEX(Personnel!$A$4:$C$51,MATCH($C$2,Personnel!$C$4:$C$51,0),1)","v":"BEARZATTO Giovanni"},{"$f":"INDEX(Personnel!$A$4:$C$51,MATCH($C$2,Personnel!$C$4:$C$51,0),1)","v":"BEARZATTO Giovanni"},null,null,null,{"$f":"SALARIE","v":"BEARZATTO Giovanni"},"CP",{"$f":"AND(Saisies!C4>=Accueil!C6,Saisies!E4<=Accueil!E6)","v":false}]
[null,"Situation à ce jour sauf erreur ou omission",null,null,null,null,null,null,{"$f":"SALARIE","v":"BEARZATTO Giovanni"},"RTT",{"$f":"AND(Saisies!C4>=RTTdeb,Saisies!E4<=RTTfin)","v":false},null,null,null,null,null,null,null,null,null,"Demande",null,null,"CP"]
[]
[null,"Congés Payés période du",{"$f":"CPdeb","v":"2015-06-01"},"au",{"$f":"CPfin","v":"2016-05-31"},null,null,null,null,null,null,null,null,null,null,null,null,null,null,null,"Nom & Prénom :",null,{"$f":"SALARIE","v":"BEARZATTO Giovanni"},null,"Date demande ",null,{"$f":"TODAY()","v":"2016-01-25"}]
[null,null,null,null,null,null,null,null,"Salarié","Date demande","début","J1","fin","J2","Nature","Statut","NB jours","mois","Remarque"]
[null,"Solde Période précédente",{"$f":"IF(SALARIE<>\"\",VLOOKUP(SALARIE,PERSONNEL[],8,FALSE),\"\")","v":1.5},null,null,null,null,null,"BEARZATTO Giovanni","2014-12-01","2015-01-02",0,"2015-01-02",0,"RTT","Acceptée",1,"2015/01","RTT Direction",null," Période demandée du :",null,null,null,null,"inclus",null,{"$f":"IF(OR(Y8=\"Matin\",Y8=\"\"),0,0.5)","v":0}]
[null,"CP pour ancienneté",{"$f":"IF(SALARIE<>\"\",VLOOKUP(SALARIE,PERSONNEL[],9,FALSE),\"\")","v":3},null,null,null,null,null,"BEARZATTO Giovanni","2015-01-07","2015-02-19",0,"2015-02-19",0,"RTT","Acceptée",1,"2015/02",0,null,null,null,null,null,"N'utiliser ces cases que pour des 1/2 journées "]
[null,"Acquis au 31/05/2015 (N-1)",{"$f":"IF(SALARIE<>\"\",VLOOKUP(SALARIE,PERSONNEL[],10,FALSE)-C8-C9,\"\")","v":24.96},null,"SOLDES",null,null,null,"BEARZATTO Giovanni","2015-01-07","2015-03-04",0,"2015-03-04",0,"RTT","Acceptée",1,"2015/03",0,null,"au :",null,null,null,null,"inclus",null,{"$f":"IF(OR(Y10=\"Après-midi\",Y10=\"\"),0,0.5)","v":0}]
[null,"TOTAL CP à prendre sur la période",{"$f":"IF(SALARIE<>\"\",C10+C9+C8,\"\")","v":29.46},null,null,null,null,null,"BEARZATTO Giovanni","2015-05-04","2015-05-15",0,"2015-05-15",0,"RTT","Acceptée",1,"2015/05",""]
[null,"NBj CP Posés et Acceptés",{"$f":"SUM(SUMIFS(Tabsaisies[NB jours],Tabsaisies[Début],\">=\"&CPdeb,Tabsaisies[Début],\"<=\"&CPfin,Tabsaisies[Salarié],\"=\"&SALARIE,Tabsaisies[Nature],\"=CP\",Tabsaisies[Statut],{\"Annulée\";\"Acceptée\"}))","v":21},null,{"$f":"IF(SALARIE<>\"\",C11-C12,\"\")","v":8.4600000000000009},null,null,null,"BEARZATTO Giovanni","2015-06-08","2015-06-22",0,"2015-06-22",0,"CP","Acceptée",1,"2015/06","Recup CP du 01/06/2015 annulé",null,"MOTIF --->\n(uniquement si Abs. Convention)",null,null,null,null,"soit :",{"$f":"IF(OR(W8=\"\",W10=\"\"),0,IF(AND(X4<>\"CP\",X4<>\"RTT\",W8<>\"\"),0,IF(U4=\"Demande\",NETWORKDAYS.INTL(W8,W10,1,JFERIES)-AB8-AB10,(NETWORKDAYS.INTL(W8,W10,1,JFERIES)-AB8-AB10)*-1)))","v":0},"jours"]
[null,"CP en attente de réponse",{"$f":"SUMIFS(Tabsaisies[NB jours],Tabsaisies[Début],\">=\"&CPdeb,Tabsaisies[Début],\"<=\"&CPfin,Tabsaisies[Salarié],\"=\"&SALARIE,Tabsaisies[Nature],\"=CP\",Tabsaisies[Statut],\"=En Attente\")","v":0},null,{"$f":"IF(C13>0,E12-C13,\"\")","v":""},null,null,null,"BEARZATTO Giovanni","2015-06-09","2015-07-13",0,"2015-07-13",0,"RTT","Acceptée",1,"2015/07",""]
[null,"Pour info, acquis depuis le 01/06/2015",{"$f":"IF(SALARIE<>\"\",VLOOKUP(SALARIE,PERSONNEL[],11,FALSE),\"\")","v":14.56},null,{"$f":"IF(SALARIE<>\"\",E12+C14,\"\")","v":23.020000000000003},null,null,null,"BEARZATTO Giovanni","2015-07-09","2015-08-17",0,"2015-08-31",0,"CP","Acceptée",11,"2015/08","Congés été 2015",null," Nouveau solde prévisonnel (hors demandes en cours) :",null,null,null,{"$f":"IF(AA12=0,\"\",IF(X4=\"CP\",E12-AA12,#REF!-AA12))","v":""},null,null,""]
[null,null,null,null,null,null,null,null,"BEARZATTO Giovanni","2015-07-09","2015-09-01",0,"2015-09-04",0,"CP","Acceptée",4,"2015/09","Congés été 2015"]
{"$rows_left_out":7}
{"sheet":"Données","index":1,"n_rows":49,"n_cols":8,"rows_kept":49,"cut":false,"hidden":false,"merged":[[4,0,4,1]]}
["ANNEE EN COURS",2015]
["CP du",{"$f":"DATE(ANNEE_LSE,6,1)","v":"2015-06-01"},"au",{"$f":"DATE(ANNEE_LSE+1,5,31)","v":"2016-05-31"}]
["RTT du ",{"$f":"DATE(ANNEE_LSE,1,1)","v":"2015-01-01"},"au",{"$f":"DATE(ANNEE_LSE,12,31)","v":"2015-12-31"}]
[]
["JOURS FERIES ",null,null,"Nature Absences",null,null,"NO","Michel Loyer <m.loyer@lse.fr>;Giovanni Bearzatto <g.bearzatto@lse.fr>"]
["Jour de l'an","2013-01-01",null,"CP",null,null,"IDF","Giovanni Bearzatto <g.bearzatto@lse.fr>"]
["Lundi de Pâques","2013-04-01",null,"RTT",null,null,"SUD","Giovanni Bearzatto <g.bearzatto@lse.fr>"]
["Fête du Travail","2013-05-01",null,"Convention"]
["8 mai 1945","2013-05-08",null,"CP sans solde"]
["Jeudi de l'Ascension","2013-05-09",null,"RTD Recup"]
["Lundi de Pentecôte","2013-05-20"]
["Fête Nationale","2013-07-14"]
["Assomption","2013-08-15"]
["La Toussaint","2013-11-01"]
["Armistice","2013-11-11"]
{"$rows_left_out":35}
{"sheet":"STATS CP","index":2,"n_rows":37,"n_cols":14,"rows_kept":37,"cut":false,"hidden":false,"merged":[]}
["Nature","CP"]
["Statut","(Plusieurs éléments)"]
[]
["Somme de NB jours","Mois"]
["Étiquettes de lignes","2014/06","2014/07","2014/08","2014/09","2014/10","2014/11","2014/12","2015/01","2015/02","2015/03","2015/04","2015/05","Total général"]
["BEARZATTO Giovanni",null,1,10,6,null,null,null,null,6,2,null,1,26]
["BERTHE Magali",null,null,9,null,null,1.5,null,1,null,null,null,1,12.5]
["CHEVALIER Yohan",null,4,5,null,null,null,null,null,null,null,null,2,11]
["COUTANT Jean Paul",1,null,15,null,null,null,null,null,null,1,5,1,23]
["DEREPPE Bruno",null,4,10,5,null,null,null,null,null,5,null,4,28]
["DREVON Alain",null,4,6,5,null,null,null,null,5,null,null,5.5,25.5]
["DREZET Olivier",1,null,16,4,null,1,1,null,null,null,4,1,28]
["GIRAUDON Alain",1,null,20,null,null,null,null,null,null,5,null,null,26]
["GUERIN Viviane",1,1,17,1,null,null,null,null,null,null,null,5,25]
["GUINOT Nathalie",null,null,15,null,null,null,null,null,5,null,2,3,25]
{"$rows_left_out":23}
{"sheet":"STATS RTT ","index":3,"n_rows":30,"n_cols":15,"rows_kept":30,"cut":false,"hidden":false,"merged":[]}
["Nature","RTT"]
["Statut","Acceptée"]
[]
["Somme de NB jours","Mois"]
["Étiquettes de lignes","2015/01","2015/02","2015/03","2015/04","2015/05","2015/06","2015/07","Total général"]
["BEARZATTO Giovanni",1,1,1,null,1,null,null,4]
["COUTANT Jean Paul",1,null,2,null,1,null,null,4]
["DEREPPE Bruno",1,null,null,null,1,null,null,2]
["DREVON Alain",1,null,null,3,null,null,null,4]
["DREZET Olivier",1,1,1.5,null,0.5,null,null,4]
["GIRAUDON Alain",1,1,0.5,null,1,null,1,4.5]
["GUERIN Viviane",2,1,null,null,null,1,1,5]
["GUINOT Nathalie",1,null,null,null,null,null,null,1]
["GUIOT Fabien",1,1,null,null,null,null,null,2,null,null,null,null,null,4]
["HAUTEBRANC Alexis",1,null,null,null,null,null,null,1]
{"$rows_left_out":16}
{"sheet":"Saisies","index":4,"n_rows":1045,"n_cols":12,"rows_kept":1045,"cut":false,"hidden":false,"merged":[[0,0,0,1]]}
["PENSER A CLIQUER SUR SAUVER",null,null,null,null,null,null,null,"Liste des demandes au ",{"$f":"TODAY()","v":"2016-01-25"}]
[null,null,null,null,null,null,null,"Sous-total",2526.5]
["Salarié","Date demande","Début","J1","Fin","J2","Nature","Statut","NB jours","mois","Remarque","verif solde"]
["SANTUCCI Lionel","2013-06-04","2013-06-07",0,"2013-06-10",0,"CP","Acceptée",{"$f":"IF(OR(G4=\"Convention\",H4=\"Refusée\"),0,IF(H4=\"Annulée\",-(NETWORKDAYS.INTL(C4,E4,1,JFERIES)-D4-F4),NETWORKDAYS.INTL(C4,E4,1,JFERIES)-D4-F4))","v":2},"2013/06"]
["SANTUCCI Lionel","2013-06-04","2013-06-12",0,"2013-06-14",0,"CP","Acceptée",{"$f":"IF(OR(G5=\"Convention\",H5=\"Refusée\"),0,IF(H5=\"Annulée\",-(NETWORKDAYS.INTL(C5,E5,1,JFERIES)-D5-F5),NETWORKDAYS.INTL(C5,E5,1,JFERIES)-D5-F5))","v":3},"2013/06"]
["DREVON Alain","2013-06-01","2013-06-12",0,"2013-06-12",0.5,"CP","Acceptée",{"$f":"IF(OR(G6=\"Convention\",H6=\"Refusée\"),0,IF(H6=\"Annulée\",-(NETWORKDAYS.INTL(C6,E6,1,JFERIES)-D6-F6),NETWORKDAYS.INTL(C6,E6,1,JFERIES)-D6-F6))","v":0.5},"2013/06"]
["DREVON Alain","2013-06-01","2013-06-14",0,"2013-06-14",0.5,"CP","Acceptée",{"$f":"IF(OR(G7=\"Convention\",H7=\"Refusée\"),0,IF(H7=\"Annulée\",-(NETWORKDAYS.INTL(C7,E7,1,JFERIES)-D7-F7),NETWORKDAYS.INTL(C7,E7,1,JFERIES)-D7-F7))","v":0.5},"2013/06"]
["DREVON Alain","2013-06-01","2013-06-28",0,"2013-06-28",0,"CP","Acceptée",{"$f":"IF(OR(G8=\"Convention\",H8=\"Refusée\"),0,IF(H8=\"Annulée\",-(NETWORKDAYS.INTL(C8,E8,1,JFERIES)-D8-F8),NETWORKDAYS.INTL(C8,E8,1,JFERIES)-D8-F8))","v":1},"2013/06"]
["DREVON Alain","2013-05-21","2013-08-16",0,"2013-08-30",0,"CP","Acceptée",{"$f":"IF(OR(G9=\"Convention\",H9=\"Refusée\"),0,IF(H9=\"Annulée\",-(NETWORKDAYS.INTL(C9,E9,1,JFERIES)-D9-F9),NETWORKDAYS.INTL(C9,E9,1,JFERIES)-D9-F9))","v":11},"2013/08"]
["LEDANT Charles","2013-05-21","2013-08-05",0,"2013-08-30",0,"CP","Acceptée",{"$f":"IF(OR(G10=\"Convention\",H10=\"Refusée\"),0,IF(H10=\"Annulée\",-(NETWORKDAYS.INTL(C10,E10,1,JFERIES)-D10-F10),NETWORKDAYS.INTL(C10,E10,1,JFERIES)-D10-F10))","v":19},"2013/08"]
["LOCATELLI Bruno","2013-06-01","2013-06-03",0,"2013-06-03",0,"CP","Acceptée",{"$f":"IF(OR(G11=\"Convention\",H11=\"Refusée\"),0,IF(H11=\"Annulée\",-(NETWORKDAYS.INTL(C11,E11,1,JFERIES)-D11-F11),NETWORKDAYS.INTL(C11,E11,1,JFERIES)-D11-F11))","v":1},"2013/06"]
["LOCATELLI Bruno","2013-06-01","2013-06-10",0,"2013-06-10",0,"CP","Acceptée",{"$f":"IF(OR(G12=\"Convention\",H12=\"Refusée\"),0,IF(H12=\"Annulée\",-(NETWORKDAYS.INTL(C12,E12,1,JFERIES)-D12-F12),NETWORKDAYS.INTL(C12,E12,1,JFERIES)-D12-F12))","v":1},"2013/06"]
["LOCATELLI Bruno","2013-06-01","2013-06-19",0,"2013-06-19",0.5,"CP","Acceptée",{"$f":"IF(OR(G13=\"Convention\",H13=\"Refusée\"),0,IF(H13=\"Annulée\",-(NETWORKDAYS.INTL(C13,E13,1,JFERIES)-D13-F13),NETWORKDAYS.INTL(C13,E13,1,JFERIES)-D13-F13))","v":0.5},"2013/06"]
["LOCATELLI Bruno","2013-06-01","2013-06-24",0,"2013-06-24",0,"CP","Acceptée",{"$f":"IF(OR(G14=\"Convention\",H14=\"Refusée\"),0,IF(H14=\"Annulée\",-(NETWORKDAYS.INTL(C14,E14,1,JFERIES)-D14-F14),NETWORKDAYS.INTL(C14,E14,1,JFERIES)-D14-F14))","v":1},"2013/06"]
["LOCATELLI Bruno","2013-07-01","2013-07-01",0.5,"2013-07-01",0,"CP","Acceptée",{"$f":"IF(OR(G15=\"Convention\",H15=\"Refusée\"),0,IF(H15=\"Annulée\",-(NETWORKDAYS.INTL(C15,E15,1,JFERIES)-D15-F15),NETWORKDAYS.INTL(C15,E15,1,JFERIES)-D15-F15))","v":0.5},"2013/07"]
{"$rows_left_out":1031}
{"sheet":"Personnel","index":5,"n_rows":35,"n_cols":29,"rows_kept":35,"cut":false,"hidden":false,"merged":[[0,15,0,16],[0,18,0,19]]}
["Nombre de jours/mois",2.08,null,null,null,null,"CP Période du",{"$f":"DATE(ANNEE_LSE,6,1)","v":"2015-06-01"},"au",{"$f":"DATE(ANNEE_LSE+1,5,31)","v":"2016-05-31"},null,{"$f":"(H1-F4)/365/5","v":3.4526027397260273},null,null,"RTT Période du","2015-01-01",null,"au","2015-12-31",null,null,null,null,null,"=ARRONDI.AU.MULTIPLE(Personnel!$M4*SOMME(Personnel!$N4:$Z4);0,5)",null,null,null,"2013-01-01"]
["TOTAUX",null,null,null,null,null,null,{"$f":"SUBTOTAL(9,Personnel!$H$4:$H$35)","v":-1.6999999999999993},{"$f":"SUBTOTAL(9,Personnel!$I$4:$I$35)","v":55},{"$f":"SUBTOTAL(9,Personnel!$J$4:$J$35)","v":780.74600000000021},null,{"$f":"SUBTOTAL(9,Personnel!$L$4:$L$35)","v":604}]
["Salarié","Sorti","User","Société","Agence","entrée","Coef","Solde N-1","ancienneté","Acquis N-1","Acquis N","Pris","RTT","RTT Solde N-1","Janv","Févr","Mars","Avril","Mai","Juin","Juillet","Aout","Sept","Oct","Nov","Déc","RTT Droits","RTT Pris","RTT Solde"]
["BEARZATTO Giovanni",null,"g.bearzatto","LSE","IDF","1998-03-01",1,1.5,{"$f":"IF(YEAR(PERSONNEL[[#This Row],[entrée]])=YEAR(CPdeb),0,MIN(4,INT((CPdeb-PERSONNEL[[#This Row],[entrée]])/365/5)))","v":3},{"$f":"$H4+$I4+IF($H$1-$F4<=0,0,IF($H$1-$F4>364,NbjCP*12*$G4,CEILING(($H$1-$F4)/30*$G4*NbjCP,0.01)))","v":29.46},{"$f":"IF($F4<$H$1,INT((TODAY()-$H$1)/30)*NbjCP*$G4,INT((TODAY()-$F4)/30)*NbjCP*$G4)","v":14.56},{"$f":"SUMIFS(Tabsaisies[NB jours],Tabsaisies[Salarié],Personnel!$A4,Tabsaisies[Nature],\"CP\",Tabsaisies[Statut],\"Acceptée\",Tabsaisies[Début],\">=\"&$H$1,Tabsaisies[Fin],\"<=\"&$J$1)","v":21},1,3,0.67,0.67,0.67,null,null,null,null,null,null,null,null,null,{"$f":"MROUND(Personnel!$M4*SUM(Personnel!$N4:$Z4),0.5)","v":5},{"$f":"SUMIFS(Tabsaisies[NB jours],Tabsaisies[Salarié],Personnel!$A4,Tabsaisies[Nature],\"RTT\",Tabsaisies[Statut],\"Acceptée\",Tabsaisies[Début],\">=\"&$P$1)","v":5},{"$f":"PERSONNEL[[#This Row],[RTT Droits]]-PERSONNEL[[#This Row],[RTT Pris]]","v":0}]
["BERTHE Magali",null,"m.berthe","LSE","SUD","2013-12-09",1,-8,{"$f":"IF(YEAR(PERSONNEL[[#This Row],[entrée]])=YEAR(CPdeb),0,MIN(4,INT((CPdeb-PERSONNEL[[#This Row],[entrée]])/365/5)))","v":0},16.96,14.56,{"$f":"SUMIFS(Tabsaisies[NB jours],Tabsaisies[Salarié],Personnel!$A5,Tabsaisies[Nature],\"CP\",Tabsaisies[Statut],\"Acceptée\",Tabsaisies[Début],\">=\"&$H$1,Tabsaisies[Fin],\"<=\"&$J$1)","v":16},0,0,0.67,0.67,0.67,null,null,null,null,null,null,null,null,null,{"$f":"MROUND(Personnel!$M5*SUM(Personnel!$N5:$Z5),0.5)","v":0},{"$f":"SUMIFS(Tabsaisies[NB jours],Tabsaisies[Salarié],Personnel!$A5,Tabsaisies[Nature],\"RTT\",Tabsaisies[Statut],\"Acceptée\",Tabsaisies[Début],\">=\"&$P$1)","v":0},{"$f":"PERSONNEL[[#This Row],[RTT Droits]]-PERSONNEL[[#This Row],[RTT Pris]]","v":0}]
["BABOULIN Marine",null,"m.baboulin","LSE","SUD","2015-10-22",1,null,{"$f":"IF(YEAR(PERSONNEL[[#This Row],[entrée]])=YEAR(CPdeb),0,MIN(4,INT((CPdeb-PERSONNEL[[#This Row],[entrée]])/365/5)))","v":0},0,6.24,{"$f":"SUMIFS(Tabsaisies[NB jours],Tabsaisies[Salarié],Personnel!$A6,Tabsaisies[Nature],\"CP\",Tabsaisies[Statut],\"Acceptée\",Tabsaisies[Début],\">=\"&$H$1,Tabsaisies[Fin],\"<=\"&$J$1)","v":0},0,0,null,null,null,null,null,null,null,null,null,null,null,null,{"$f":"MROUND(Personnel!$M6*SUM(Personnel!$N6:$Z6),0.5)","v":0},{"$f":"SUMIFS(Tabsaisies[NB jours],Tabsaisies[Salarié],Personnel!$A6,Tabsaisies[Nature],\"RTT\",Tabsaisies[Statut],\"Acceptée\",Tabsaisies[Début],\">=\"&$P$1)","v":0},{"$f":"PERSONNEL[[#This Row],[RTT Droits]]-PERSONNEL[[#This Row],[RTT Pris]]","v":0}]
["CHEVALIER Yohan",null,"y.chevalier","LSE","SUD","2014-02-12",1,-8.6999999999999993,{"$f":"IF(YEAR(PERSONNEL[[#This Row],[entrée]])=YEAR(CPdeb),0,MIN(4,INT((CPdeb-PERSONNEL[[#This Row],[entrée]])/365/5)))","v":0},16.260000000000002,14.56,{"$f":"SUMIFS(Tabsaisies[NB jours],Tabsaisies[Salarié],Personnel!$A7,Tabsaisies[Nature],\"CP\",Tabsaisies[Statut],\"Acceptée\",Tabsaisies[Début],\">=\"&$H$1,Tabsaisies[Fin],\"<=\"&$J$1)","v":21},0,0,0.67,0.67,0.67,null,null,null,null,null,null,null,null,null,{"$f":"MROUND(Personnel!$M7*SUM(Personnel!$N7:$Z7),0.5)","v":0},{"$f":"SUMIFS(Tabsaisies[NB jours],Tabsaisies[Salarié],Personnel!$A7,Tabsaisies[Nature],\"RTT\",Tabsaisies[Statut],\"Acceptée\",Tabsaisies[Début],\">=\"&$P$1)","v":0},{"$f":"PERSONNEL[[#This Row],[RTT Droits]]-PERSONNEL[[#This Row],[RTT Pris]]","v":0}]
["COUTANT Jean Paul",null,"jp.coutant","LSE","IDF","1994-01-01",1,6,{"$f":"IF(YEAR(PERSONNEL[[#This Row],[entrée]])=YEAR(CPdeb),0,MIN(4,INT((CPdeb-PERSONNEL[[#This Row],[entrée]])/365/5)))","v":4},34.96,14.56,{"$f":"SUMIFS(Tabsaisies[NB jours],Tabsaisies[Salarié],Personnel!$A8,Tabsaisies[Nature],\"CP\",Tabsaisies[Statut],\"Acceptée\",Tabsaisies[Début],\">=\"&$H$1,Tabsaisies[Fin],\"<=\"&$J$1)","v":27.5},1,2,0.67,0.67,0.67,null,null,null,null,null,null,null,null,null,{"$f":"MROUND(Personnel!$M8*SUM(Personnel!$N8:$Z8),0.5)","v":4},{"$f":"SUMIFS(Tabsaisies[NB jours],Tabsaisies[Salarié],Personnel!$A8,Tabsaisies[Nature],\"RTT\",Tabsaisies[Statut],\"Acceptée\",Tabsaisies[Début],\">=\"&$P$1)","v":4},{"$f":"PERSONNEL[[#This Row],[RTT Droits]]-PERSONNEL[[#This Row],[RTT Pris]]","v":0}]
["DEREPPE Bruno",null,"b.dereppe","LSE","IDF","1999-05-01",1,0,{"$f":"IF(YEAR(PERSONNEL[[#This Row],[entrée]])=YEAR(CPdeb),0,MIN(4,INT((CPdeb-PERSONNEL[[#This Row],[entrée]])/365/5)))","v":3},27.96,14.56,{"$f":"SUMIFS(Tabsaisies[NB jours],Tabsaisies[Salarié],Personnel!$A9,Tabsaisies[Nature],\"CP\",Tabsaisies[Statut],\"Acceptée\",Tabsaisies[Début],\">=\"&$H$1,Tabsaisies[Fin],\"<=\"&$J$1)","v":21},1,1.5,0.67,0.67,0.67,null,null,null,null,null,null,null,null,null,{"$f":"MROUND(Personnel!$M9*SUM(Personnel!$N9:$Z9),0.5)","v":3.5},{"$f":"SUMIFS(Tabsaisies[NB jours],Tabsaisies[Salarié],Personnel!$A9,Tabsaisies[Nature],\"RTT\",Tabsaisies[Statut],\"Acceptée\",Tabsaisies[Début],\">=\"&$P$1)","v":3},{"$f":"PERSONNEL[[#This Row],[RTT Droits]]-PERSONNEL[[#This Row],[RTT Pris]]","v":0.5}]
["DREVON Alain",null,"a.drevon","LSE","SUD","1997-01-01",1,0,{"$f":"IF(YEAR(PERSONNEL[[#This Row],[entrée]])=YEAR(CPdeb),0,MIN(4,INT((CPdeb-PERSONNEL[[#This Row],[entrée]])/365/5)))","v":3},27.96,14.56,{"$f":"SUMIFS(Tabsaisies[NB jours],Tabsaisies[Salarié],Personnel!$A10,Tabsaisies[Nature],\"CP\",Tabsaisies[Statut],\"Acceptée\",Tabsaisies[Début],\">=\"&$H$1,Tabsaisies[Fin],\"<=\"&$J$1)","v":23.5},1,2,0.67,0.67,0.67,null,null,null,null,null,null,null,null,null,{"$f":"MROUND(Personnel!$M10*SUM(Personnel!$N10:$Z10),0.5)","v":4},{"$f":"SUMIFS(Tabsaisies[NB jours],Tabsaisies[Salarié],Personnel!$A10,Tabsaisies[Nature],\"RTT\",Tabsaisies[Statut],\"Acceptée\",Tabsaisies[Début],\">=\"&$P$1)","v":4},{"$f":"PERSONNEL[[#This Row],[RTT Droits]]-PERSONNEL[[#This Row],[RTT Pris]]","v":0}]
["DREZET Olivier",null,"olivier.drezet","LSE","IDF","1995-10-01",1,3.5,{"$f":"IF(YEAR(PERSONNEL[[#This Row],[entrée]])=YEAR(CPdeb),0,MIN(4,INT((CPdeb-PERSONNEL[[#This Row],[entrée]])/365/5)))","v":3},31.46,14.56,{"$f":"SUMIFS(Tabsaisies[NB jours],Tabsaisies[Salarié],Personnel!$A11,Tabsaisies[Nature],\"CP\",Tabsaisies[Statut],\"Acceptée\",Tabsaisies[Début],\">=\"&$H$1,Tabsaisies[Fin],\"<=\"&$J$1)","v":26},1,2,0.67,0.67,0.67,null,null,null,null,null,null,null,null,null,{"$f":"MROUND(Personnel!$M11*SUM(Personnel!$N11:$Z11),0.5)","v":4},{"$f":"SUMIFS(Tabsaisies[NB jours],Tabsaisies[Salarié],Personnel!$A11,Tabsaisies[Nature],\"RTT\",Tabsaisies[Statut],\"Acceptée\",Tabsaisies[Début],\">=\"&$P$1)","v":4},{"$f":"PERSONNEL[[#This Row],[RTT Droits]]-PERSONNEL[[#This Row],[RTT Pris]]","v":0}]
["GIRAUDON Alain",null,"a.giraudon","LSE","IDF","2008-04-01",1,0,{"$f":"IF(YEAR(PERSONNEL[[#This Row],[entrée]])=YEAR(CPdeb),0,MIN(4,INT((CPdeb-PERSONNEL[[#This Row],[entrée]])/365/5)))","v":1},25.96,14.56,{"$f":"SUMIFS(Tabsaisies[NB jours],Tabsaisies[Salarié],Personnel!$A12,Tabsaisies[Nature],\"CP\",Tabsaisies[Statut],\"Acceptée\",Tabsaisies[Début],\">=\"&$H$1,Tabsaisies[Fin],\"<=\"&$J$1)","v":25.5},1,2.5,0.67,0.67,0.67,null,null,null,null,null,null,null,null,null,{"$f":"MROUND(Personnel!$M12*SUM(Personnel!$N12:$Z12),0.5)","v":4.5},{"$f":"SUMIFS(Tabsaisies[NB jours],Tabsaisies[Salarié],Personnel!$A12,Tabsaisies[Nature],\"RTT\",Tabsaisies[Statut],\"Acceptée\",Tabsaisies[Début],\">=\"&$P$1)","v":4.5},{"$f":"PERSONNEL[[#This Row],[RTT Droits]]-PERSONNEL[[#This Row],[RTT Pris]]","v":0}]
["GUERIN Viviane",null,"v.guerin","LSE","SUD","2005-03-01",1,6,{"$f":"IF(YEAR(PERSONNEL[[#This Row],[entrée]])=YEAR(CPdeb),0,MIN(4,INT((CPdeb-PERSONNEL[[#This Row],[entrée]])/365/5)))","v":2},32.96,14.56,{"$f":"SUMIFS(Tabsaisies[NB jours],Tabsaisies[Salarié],Personnel!$A13,Tabsaisies[Nature],\"CP\",Tabsaisies[Statut],\"Acceptée\",Tabsaisies[Début],\">=\"&$H$1,Tabsaisies[Fin],\"<=\"&$J$1)","v":23},1,3,0.67,0.67,0.67,null,null,null,null,null,null,null,null,null,{"$f":"MROUND(Personnel!$M13*SUM(Personnel!$N13:$Z13),0.5)","v":5},{"$f":"SUMIFS(Tabsaisies[NB jours],Tabsaisies[Salarié],Personnel!$A13,Tabsaisies[Nature],\"RTT\",Tabsaisies[Statut],\"Acceptée\",Tabsaisies[Début],\">=\"&$P$1)","v":5},{"$f":"PERSONNEL[[#This Row],[RTT Droits]]-PERSONNEL[[#This Row],[RTT Pris]]","v":0}]
["GUINOT Nathalie",null,"n.guinot","LSE","IDF","2010-09-01",1,0,{"$f":"IF(YEAR(PERSONNEL[[#This Row],[entrée]])=YEAR(CPdeb),0,MIN(4,INT((CPdeb-PERSONNEL[[#This Row],[entrée]])/365/5)))","v":0},24.96,14.56,{"$f":"SUMIFS(Tabsaisies[NB jours],Tabsaisies[Salarié],Personnel!$A14,Tabsaisies[Nature],\"CP\",Tabsaisies[Statut],\"Acceptée\",Tabsaisies[Début],\">=\"&$H$1,Tabsaisies[Fin],\"<=\"&$J$1)","v":20},1,3.5,0.67,0.67,0.67,null,null,null,null,null,null,null,null,null,{"$f":"MROUND(Personnel!$M14*SUM(Personnel!$N14:$Z14),0.5)","v":5.5},{"$f":"SUMIFS(Tabsaisies[NB jours],Tabsaisies[Salarié],Personnel!$A14,Tabsaisies[Nature],\"RTT\",Tabsaisies[Statut],\"Acceptée\",Tabsaisies[Début],\">=\"&$P$1)","v":5.5},{"$f":"PERSONNEL[[#This Row],[RTT Droits]]-PERSONNEL[[#This Row],[RTT Pris]]","v":0}]
["GUIOT Fabien",null,"f.guiot","LSE","IDF","2010-02-01",1,0,{"$f":"IF(YEAR(PERSONNEL[[#This Row],[entrée]])=YEAR(CPdeb),0,MIN(4,INT((CPdeb-PERSONNEL[[#This Row],[entrée]])/365/5)))","v":1},25.96,14.56,{"$f":"SUMIFS(Tabsaisies[NB jours],Tabsaisies[Salarié],Personnel!$A15,Tabsaisies[Nature],\"CP\",Tabsaisies[Statut],\"Acceptée\",Tabsaisies[Début],\">=\"&$H$1,Tabsaisies[Fin],\"<=\"&$J$1)","v":15.5},1,2,0.67,0.67,0.67,null,null,null,null,null,null,null,null,null,{"$f":"MROUND(Personnel!$M15*SUM(Personnel!$N15:$Z15),0.5)","v":4},{"$f":"SUMIFS(Tabsaisies[NB jours],Tabsaisies[Salarié],Personnel!$A15,Tabsaisies[Nature],\"RTT\",Tabsaisies[Statut],\"Acceptée\",Tabsaisies[Début],\">=\"&$P$1)","v":4},{"$f":"PERSONNEL[[#This Row],[RTT Droits]]-PERSONNEL[[#This Row],[RTT Pris]]","v":0}]
{"$rows_left_out":21}
{"sheet":"Feuil1","index":6,"n_rows":40,"n_cols":14,"rows_kept":40,"cut":false,"hidden":false,"merged":[]}
[]
[]
[]
["Nature","CP"]
[]
["Somme de NB jours","mois"]
[null,"2014",null,null,null,null,null,null,"2015",null,null,null,null,"Total général"]
["Étiquettes de lignes","juin","juil","août","sept","oct","nov","déc","janv","févr","mars","avr","mai"]
["BEARZATTO Giovanni",null,1,10,6,null,null,null,null,6,2,null,1,26]
["BERTHE Magali",null,null,9,null,null,1.5,null,1,null,null,null,1,12.5]
["CHEVALIER Yohan",null,4,5,null,null,null,0,null,null,null,null,2,11]
["COUTANT Jean Paul",1,null,15,null,null,null,null,null,null,1,5,1,23]
["DEREPPE Bruno",null,4,10,5,null,null,null,null,null,5,null,4,28]
["DREVON Alain",null,4,6,5,null,null,null,null,5,null,null,5.5,25.5]
["DREZET Olivier",1,null,16,4,null,1,1,null,null,null,4,1,28]
{"$rows_left_out":25}