{"text_format":"1","workbook":"xlsx","n_sheets":7,"sheets":["Accueil","Données","STATS CP","STATS RTT ","Saisies","Personnel","Feuil1"],"not_rendered":{"charts":0,"images":0,"macros":1,"external_links":0,"defined_names":27,"comments":2,"pivot_tables":3},"unopened":[],"bounds":{"document_bytes":16777216,"sheet_cells":100000,"rows_first":2000,"rows_last":500,"rows_between":2000,"halvings":0,"cell_chars":16384,"cell_head_chars":4096},"cells_cut":0,"cells_raw":0,"read":"whole","date_system":"1900"}

{"sheet":"Accueil","index":0,"n_rows":21,"n_cols":32,"rows_kept":21,"cut":false,"hidden":false,"merged":[[3,23,3,25],[11,26,12,26],[11,27,12,27],[11,20,12,21],[11,22,12,24],[11,25,12,25],[5,20,5,21],[7,20,7,21],[4,20,4,27],[6,20,6,27],[5,24,5,25],[5,22,5,23],[9,20,9,21],[7,25,7,26],[9,25,9,26],[3,26,3,27],[15,20,15,21],[16,20,16,21],[1,2,1,4],[2,2,2,4],[3,1,3,5],[3,20,3,22]]}
[]
[null,{"$f":"TODAY()","v":"2016-01-25"},"g.bearzatto",null,null,null,null,null,"Salarié","NATURE","Formule"]
[null,"Bonjour   ",{"$f":"INDEX(Personnel!$A$4:$C$51,MATCH($C$2,Personnel!$C$4:$C$51,0),1)","v":"BEARZATTO Giovanni"},{"$f":"INDEX(Personnel!$A$4:$C$51,MATCH($C$2,Personnel!$C$4:$C$51,0),1)","v":"BEARZATTO Giovanni"},{"$f":"INDEX(Personnel!$A$4:$C$51,MATCH($C$2,Personnel!$C$4:$C$51,0),1)","v":"BEARZATTO Giovanni"},null,null,null,{"$f":"SALARIE","v":"BEARZATTO Giovanni"},"CP",{"$f":"AND(Saisies!C4>=Accueil!C6,Saisies!E4<=Accueil!E6)","v":false}]
[null,"Situation à ce jour sauf erreur ou omission",null,null,null,null,null,null,{"$f":"SALARIE","v":"BEARZATTO Giovanni"},"RTT",{"$f":"AND(Saisies!C4>=RTTdeb,Saisies!E4<=RTTfin)","v":false},null,null,null,null,null,null,null,null,null,"Demande",null,null,"CP"]
[]
[null,"Congés Payés période du",{"$f":"CPdeb","v":"2015-06-01"},"au",{"$f":"CPfin","v":"2016-05-31"},null,null,null,null,null,null,null,null,null,null,null,null,null,null,null,"Nom & Prénom :",null,{"$f":"SALARIE","v":"BEARZATTO Giovanni"},null,"Date demande ",null,{"$f":"TODAY()","v":"2016-01-25"}]
[null,null,null,null,null,null,null,null,"Salarié","Date demande","début","J1","fin","J2","Nature","Statut","NB jours","mois","Remarque"]
[null,"Solde Période précédente",{"$f":"IF(SALARIE<>\"\",VLOOKUP(SALARIE,PERSONNEL[],8,FALSE),\"\")","v":1.5},null,null,null,null,null,"BEARZATTO Giovanni","2014-12-01","2015-01-02",0,"2015-01-02",0,"RTT","Acceptée",1,"2015/01","RTT Direction",null," Période demandée du :",null,null,null,null,"inclus",null,{"$f":"IF(OR(Y8=\"Matin\",Y8=\"\"),0,0.5)","v":0}]
[null,"CP pour ancienneté",{"$f":"IF(SALARIE<>\"\",VLOOKUP(SALARIE,PERSONNEL[],9,FALSE),\"\")","v":3},null,null,null,null,null,"BEARZATTO Giovanni","2015-01-07","2015-02-19",0,"2015-02-19",0,"RTT","Acceptée",1,"2015/02",0,null,null,null,null,null,"N'utiliser ces cases que pour des 1/2 journées "]
[null,"Acquis au 31/05/2015 (N-1)",{"$f":"IF(SALARIE<>\"\",VLOOKUP(SALARIE,PERSONNEL[],10,FALSE)-C8-C9,\"\")","v":24.96},null,"SOLDES",null,null,null,"BEARZATTO Giovanni","2015-01-07","2015-03-04",0,"2015-03-04",0,"RTT","Acceptée",1,"2015/03",0,null,"au :",null,null,null,null,"inclus",null,{"$f":"IF(OR(Y10=\"Après-midi\",Y10=\"\"),0,0.5)","v":0}]
[null,"TOTAL CP à prendre sur la période",{"$f":"IF(SALARIE<>\"\",C10+C9+C8,\"\")","v":29.46},null,null,null,null,null,"BEARZATTO Giovanni","2015-05-04","2015-05-15",0,"2015-05-15",0,"RTT","Acceptée",1,"2015/05",""]
[null,"NBj CP Posés et Acceptés",{"$f":"SUM(SUMIFS(Tabsaisies[NB jours],Tabsaisies[Début],\">=\"&CPdeb,Tabsaisies[Début],\"<=\"&CPfin,Tabsaisies[Salarié],\"=\"&SALARIE,Tabsaisies[Nature],\"=CP\",Tabsaisies[Statut],{\"Annulée\";\"Acceptée\"}))","v":21},null,{"$f":"IF(SALARIE<>\"\",C11-C12,\"\")","v":8.4600000000000009},null,null,null,"BEARZATTO Giovanni","2015-06-08","2015-06-22",0,"2015-06-22",0,"CP","Acceptée",1,"2015/06","Recup CP du 01/06/2015 annulé",null,"MOTIF --->\n(uniquement si Abs. Convention)",null,null,null,null,"soit :",{"$f":"IF(OR(W8=\"\",W10=\"\"),0,IF(AND(X4<>\"CP\",X4<>\"RTT\",W8<>\"\"),0,IF(U4=\"Demande\",NETWORKDAYS.INTL(W8,W10,1,JFERIES)-AB8-AB10,(NETWORKDAYS.INTL(W8,W10,1,JFERIES)-AB8-AB10)*-1)))","v":0},"jours"]
[null,"CP en attente de réponse",{"$f":"SUMIFS(Tabsaisies[NB jours],Tabsaisies[Début],\">=\"&CPdeb,Tabsaisies[Début],\"<=\"&CPfin,Tabsaisies[Salarié],\"=\"&SALARIE,Tabsaisies[Nature],\"=CP\",Tabsaisies[Statut],\"=En Attente\")","v":0},null,{"$f":"IF(C13>0,E12-C13,\"\")","v":""},null,null,null,"BEARZATTO Giovanni","2015-06-09","2015-07-13",0,"2015-07-13",0,"RTT","Acceptée",1,"2015/07",""]
[null,"Pour info, acquis depuis le 01/06/2015",{"$f":"IF(SALARIE<>\"\",VLOOKUP(SALARIE,PERSONNEL[],11,FALSE),\"\")","v":14.56},null,{"$f":"IF(SALARIE<>\"\",E12+C14,\"\")","v":23.020000000000003},null,null,null,"BEARZATTO Giovanni","2015-07-09","2015-08-17",0,"2015-08-31",0,"CP","Acceptée",11,"2015/08","Congés été 2015",null," Nouveau solde prévisonnel (hors demandes en cours) :",null,null,null,{"$f":"IF(AA12=0,\"\",IF(X4=\"CP\",E12-AA12,#REF!-AA12))","v":""},null,null,""]
[null,null,null,null,null,null,null,null,"BEARZATTO Giovanni","2015-07-09","2015-09-01",0,"2015-09-04",0,"CP","Acceptée",4,"2015/09","Congés été 2015"]
[null,null,null,null,null,null,null,null,"BEARZATTO Giovanni","2015-09-14","2015-10-12",0,"2015-10-12",0,"CP","Acceptée",1,"2015/10","",null,"Destinataire :",null,"g.bearzatto@lse.fr"]
[null,null,null,null,null,null,null,null,"BEARZATTO Giovanni","2015-11-26","2015-12-11",0,"2015-12-11",0,"CP","Acceptée",1,"2015/12","",null,"Depuis et Copie à :",null,{"$f":"IF(SALARIE<>\"\",VLOOKUP(SALARIE,PERSONNEL[],3,FALSE)&\"@lse.fr\",\"\")","v":"g.bearzatto@lse.fr"}]
[null,null,null,null,null,null,null,null,"BEARZATTO Giovanni","2015-11-26","2015-12-31",0,"2016-01-04",0,"CP","Acceptée",2,"2016/01",""]
[null,null,null,null,null,null,null,null,"BEARZATTO Giovanni","2016-01-05","2016-01-29",0,"2016-01-29",0,"CP","Acceptée",1,"2016/01",""]
[]
["*",{"$f":"INDEX(Personnel!$A$4:$C$51,MATCH($C$2,Personnel!$C$4:$C$51,0),1)","v":"BEARZATTO Giovanni"},null,null,null,null,null,null,null,null,null,null,null,null,null,null,null,null,null,"*",{"$f":"W6","v":"BEARZATTO Giovanni"},{"$f":"AA6","v":"2016-01-25"},{"$f":"W8","v":"00:00:00"},{"$f":"AB8","v":0},{"$f":"W10","v":"00:00:00"},{"$f":"AB10","v":0},{"$f":"X4","v":"CP"},"En Attente",{"$f":"AA12","v":0},{"$f":"YEAR(W21)&\"/\"&TEXT(W21,\"mm\")","v":"1900/01"},"",{"$f":"Y14","v":""}]

{"sheet":"Données","index":1,"n_rows":49,"n_cols":8,"rows_kept":49,"cut":false,"hidden":false,"merged":[[4,0,4,1]]}
["ANNEE EN COURS",2015]
["CP du",{"$f":"DATE(ANNEE_LSE,6,1)","v":"2015-06-01"},"au",{"$f":"DATE(ANNEE_LSE+1,5,31)","v":"2016-05-31"}]
["RTT du ",{"$f":"DATE(ANNEE_LSE,1,1)","v":"2015-01-01"},"au",{"$f":"DATE(ANNEE_LSE,12,31)","v":"2015-12-31"}]
[]
["JOURS FERIES ",null,null,"Nature Absences",null,null,"NO","Michel Loyer <m.loyer@lse.fr>;Giovanni Bearzatto <g.bearzatto@lse.fr>"]
["Jour de l'an","2013-01-01",null,"CP",null,null,"IDF","Giovanni Bearzatto <g.bearzatto@lse.fr>"]
["Lundi de Pâques","2013-04-01",null,"RTT",null,null,"SUD","Giovanni Bearzatto <g.bearzatto@lse.fr>"]
["Fête du Travail","2013-05-01",null,"Convention"]
["8 mai 1945","2013-05-08",null,"CP sans solde"]
["Jeudi de l'Ascension","2013-05-09",null,"RTD Recup"]
["Lundi de Pentecôte","2013-05-20"]
["Fête Nationale","2013-07-14"]
["Assomption","2013-08-15"]
["La Toussaint","2013-11-01"]
["Armistice","2013-11-11"]
["Noël","2013-12-25"]
["Jour de l'an","2014-01-01"]
["Lundi de Pâques","2014-04-21"]
["Fête du Travail","2014-05-01"]
["8 mai 1945","2014-05-08"]
["Jeudi de l'Ascension","2014-05-29"]
["Lundi de Pentecôte"]
["Fête Nationale","2014-07-14"]
["Assomption","2014-08-15"]
["La Toussaint","2014-11-01"]
["Armistice","2014-11-11"]
["Noël","2014-12-25"]
["Jour de l'an","2015-01-01"]
["Lundi de Pâques","2015-04-06"]
["Fête du Travail","2015-05-01"]
["8 mai 1945","2015-05-08"]
["Jeudi de l'Ascension","2015-05-14"]
["Lundi de Pentecôte","2015-05-25"]
["Fête Nationale","2015-07-14"]
["Assomption","2015-08-15"]
["La Toussaint","2015-11-01"]
["Armistice","2015-11-11"]
["Noël","2015-12-25"]
["Jour de l'an","2016-01-01"]
["Lundi de Pâques","2016-03-28"]
["Fête du Travail","2016-05-01"]
["8 mai 1945","2016-05-08"]
["Jeudi de l'Ascension","2016-05-05"]
["Lundi de Pentecôte","2016-05-16"]
["Fête Nationale","2016-07-14"]
["Assomption","2016-08-15"]
["La Toussaint","2016-11-01"]
["Armistice","2016-11-11"]
["Noël","2016-12-25"]

{"sheet":"STATS CP","index":2,"n_rows":37,"n_cols":14,"rows_kept":37,"cut":false,"hidden":false,"merged":[]}
["Nature","CP"]
["Statut","(Plusieurs éléments)"]
[]
["Somme de NB jours","Mois"]
["Étiquettes de lignes","2014/06","2014/07","2014/08","2014/09","2014/10","2014/11","2014/12","2015/01","2015/02","2015/03","2015/04","2015/05","Total général"]
["BEARZATTO Giovanni",null,1,10,6,null,null,null,null,6,2,null,1,26]
["BERTHE Magali",null,null,9,null,null,1.5,null,1,null,null,null,1,12.5]
["CHEVALIER Yohan",null,4,5,null,null,null,null,null,null,null,null,2,11]
["COUTANT Jean Paul",1,null,15,null,null,null,null,null,null,1,5,1,23]
["DEREPPE Bruno",null,4,10,5,null,null,null,null,null,5,null,4,28]
["DREVON Alain",null,4,6,5,null,null,null,null,5,null,null,5.5,25.5]
["DREZET Olivier",1,null,16,4,null,1,1,null,null,null,4,1,28]
["GIRAUDON Alain",1,null,20,null,null,null,null,null,null,5,null,null,26]
["GUERIN Viviane",1,1,17,1,null,null,null,null,null,null,null,5,25]
["GUINOT Nathalie",null,null,15,null,null,null,null,null,5,null,2,3,25]
["GUIOT Fabien",null,null,15,null,null,null,1,null,null,null,4,5,25]
["HAUTEBRANC Alexis",null,4,6,5,1,null,0.5,null,null,2.5,null,6,25]
["HEMLER Christelle",null,4,6,5,null,null,0.5,null,null,2,2,6,25.5]
["KADEM Christophe",null,null,15,null,null,null,1,null,null,5,null,4.5,25.5]
["LANGE Sébastien",null,null,null,null,null,null,null,1,null,null,null,0.5,1.5]
["LAZZARO Fabien",null,4,11,null,null,null,null,null,null,null,null,null,15]
["LEDANT Charles",null,null,17,null,null,1,null,2,null,3,1,5,29]
["LOCATELLI Bruno",null,null,5,11,null,null,null,null,null,5,1,5,27]
["LOYER Michel",1,7,10,1,1,null,1,null,null,2,null,3,26]
["MARAIS Bernard",null,null,9,null,10,null,1,1,5,null,null,1,27]
["MARZOUK Sami",null,null,20,null,null,null,1,null,null,null,8,null,29]
["MINAKIAN Mathilde",null,1,15,null,null,1,null,1,null,null,null,null,18]
["PLONQUET Christian",null,null,17,5,0,2,null,null,null,null,null,null,24]
["POMMERELL Patrick",null,null,15,null,null,null,null,null,2,null,4,0,21]
["PONS Olivier",null,5,10,null,null,null,null,null,null,7,null,null,22]
["ROBIN Kevin",null,1,15,null,null,1,1.5,1,2,1,1.5,null,24]
["SANTUCCI Lionel",null,null,15,1,null,null,1,null,null,2,3,8,30]
["SIODMAK Eric",null,null,14,2,null,null,1,null,5,0,null,4,26]
["SOUCHET Alain",null,null,null,20,null,null,null,null,null,null,2.5,7,29.5]
["TAQUET Alain",2,null,14,1,null,null,null,null,null,4,null,5.5,26.5]
["VAUTRAIN Franck",null,null,15,null,null,null,null,null,null,null,5,5,25]
["Total général",7,40,367,72,12,7.5,10.5,7,30,46.5,43,89,731.5]

{"sheet":"STATS RTT ","index":3,"n_rows":30,"n_cols":15,"rows_kept":30,"cut":false,"hidden":false,"merged":[]}
["Nature","RTT"]
["Statut","Acceptée"]
[]
["Somme de NB jours","Mois"]
["Étiquettes de lignes","2015/01","2015/02","2015/03","2015/04","2015/05","2015/06","2015/07","Total général"]
["BEARZATTO Giovanni",1,1,1,null,1,null,null,4]
["COUTANT Jean Paul",1,null,2,null,1,null,null,4]
["DEREPPE Bruno",1,null,null,null,1,null,null,2]
["DREVON Alain",1,null,null,3,null,null,null,4]
["DREZET Olivier",1,1,1.5,null,0.5,null,null,4]
["GIRAUDON Alain",1,1,0.5,null,1,null,1,4.5]
["GUERIN Viviane",2,1,null,null,null,1,1,5]
["GUINOT Nathalie",1,null,null,null,null,null,null,1]
["GUIOT Fabien",1,1,null,null,null,null,null,2,null,null,null,null,null,4]
["HAUTEBRANC Alexis",1,null,null,null,null,null,null,1]
["HEMLER Christelle",1,0.5,null,null,null,null,null,1.5]
["KADEM Christophe",1,null,2,null,null,null,null,3]
["LAZZARO Fabien",1,null,null,null,null,null,null,1]
["LEDANT Charles",1,null,null,1,null,null,null,2]
["LOCATELLI Bruno",3,null,null,null,null,1,null,4]
["LOYER Michel",1,null,1,null,1,null,null,3]
["MARZOUK Sami",1,null,null,null,null,null,null,1]
["POMMERELL Patrick",1,null,0.5,0.5,null,1,null,3]
["PONS Olivier",2,1,null,null,1,null,null,4]
["SANTUCCI Lionel",2,null,null,null,2,null,null,4]
["SIODMAK Eric",1,null,null,null,null,null,null,1]
["SOUCHET Alain",1,null,null,null,null,null,null,1]
["TAQUET Alain",1,1,1,null,null,null,1,4]
["VAUTRAIN Franck",2,1,1,0.5,null,null,null,4.5]
["Total général",30,8.5,10.5,5,8.5,3,3,68.5]

{"sheet":"Saisies","index":4,"n_rows":1045,"n_cols":12,"rows_kept":1045,"cut":false,"hidden":false,"merged":[[0,0,0,1]]}
["PENSER A CLIQUER SUR SAUVER",null,null,null,null,null,null,null,"Liste des demandes au ",{"$f":"TODAY()","v":"2016-01-25"}]
[null,null,null,null,null,null,null,"Sous-total",2526.5]
["Salarié","Date demande","Début","J1","Fin","J2","Nature","Statut","NB jours","mois","Remarque","verif solde"]
["SANTUCCI Lionel","2013-06-04","2013-06-07",0,"2013-06-10",0,"CP","Acceptée",{"$f":"IF(OR(G4=\"Convention\",H4=\"Refusée\"),0,IF(H4=\"Annulée\",-(NETWORKDAYS.INTL(C4,E4,1,JFERIES)-D4-F4),NETWORKDAYS.INTL(C4,E4,1,JFERIES)-D4-F4))","v":2},"2013/06"]
["SANTUCCI Lionel","2013-06-04","2013-06-12",0,"2013-06-14",0,"CP","Acceptée",{"$f":"IF(OR(G5=\"Convention\",H5=\"Refusée\"),0,IF(H5=\"Annulée\",-(NETWORKDAYS.INTL(C5,E5,1,JFERIES)-D5-F5),NETWORKDAYS.INTL(C5,E5,1,JFERIES)-D5-F5))","v":3},"2013/06"]
["DREVON Alain","2013-06-01","2013-06-12",0,"2013-06-12",0.5,"CP","Acceptée",{"$f":"IF(OR(G6=\"Convention\",H6=\"Refusée\"),0,IF(H6=\"Annulée\",-(NETWORKDAYS.INTL(C6,E6,1,JFERIES)-D6-F6),NETWORKDAYS.INTL(C6,E6,1,JFERIES)-D6-F6))","v":0.5},"2013/06"]
["DREVON Alain","2013-06-01","2013-06-14",0,"2013-06-14",0.5,"CP","Acceptée",{"$f":"IF(OR(G7=\"Convention\",H7=\"Refusée\"),0,IF(H7=\"Annulée\",-(NETWORKDAYS.INTL(C7,E7,1,JFERIES)-D7-F7),NETWORKDAYS.INTL(C7,E7,1,JFERIES)-D7-F7))","v":0.5},"2013/06"]
["DREVON Alain","2013-06-01","2013-06-28",0,"2013-06-28",0,"CP","Acceptée",{"$f":"IF(OR(G8=\"Convention\",H8=\"Refusée\"),0,IF(H8=\"Annulée\",-(NETWORKDAYS.INTL(C8,E8,1,JFERIES)-D8-F8),NETWORKDAYS.INTL(C8,E8,1,JFERIES)-D8-F8))","v":1},"2013/06"]
["DREVON Alain","2013-05-21","2013-08-16",0,"2013-08-30",0,"CP","Acceptée",{"$f":"IF(OR(G9=\"Convention\",H9=\"Refusée\"),0,IF(H9=\"Annulée\",-(NETWORKDAYS.INTL(C9,E9,1,JFERIES)-D9-F9),NETWORKDAYS.INTL(C9,E9,1,JFERIES)-D9-F9))","v":11},"2013/08"]
["LEDANT Charles","2013-05-21","2013-08-05",0,"2013-08-30",0,"CP","Acceptée",{"$f":"IF(OR(G10=\"Convention\",H10=\"Refusée\"),0,IF(H10=\"Annulée\",-(NETWORKDAYS.INTL(C10,E10,1,JFERIES)-D10-F10),NETWORKDAYS.INTL(C10,E10,1,JFERIES)-D10-F10))","v":19},"2013/08"]
["LOCATELLI Bruno","2013-06-01","2013-06-03",0,"2013-06-03",0,"CP","Acceptée",{"$f":"IF(OR(G11=\"Convention\",H11=\"Refusée\"),0,IF(H11=\"Annulée\",-(NETWORKDAYS.INTL(C11,E11,1,JFERIES)-D11-F11),NETWORKDAYS.INTL(C11,E11,1,JFERIES)-D11-F11))","v":1},"2013/06"]
["LOCATELLI Bruno","2013-06-01","2013-06-10",0,"2013-06-10",0,"CP","Acceptée",{"$f":"IF(OR(G12=\"Convention\",H12=\"Refusée\"),0,IF(H12=\"Annulée\",-(NETWORKDAYS.INTL(C12,E12,1,JFERIES)-D12-F12),NETWORKDAYS.INTL(C12,E12,1,JFERIES)-D12-F12))","v":1},"2013/06"]
["LOCATELLI Bruno","2013-06-01","2013-06-19",0,"2013-06-19",0.5,"CP","Acceptée",{"$f":"IF(OR(G13=\"Convention\",H13=\"Refusée\"),0,IF(H13=\"Annulée\",-(NETWORKDAYS.INTL(C13,E13,1,JFERIES)-D13-F13),NETWORKDAYS.INTL(C13,E13,1,JFERIES)-D13-F13))","v":0.5},"2013/06"]
["LOCATELLI Bruno","2013-06-01","2013-06-24",0,"2013-06-24",0,"CP","Acceptée",{"$f":"IF(OR(G14=\"Convention\",H14=\"Refusée\"),0,IF(H14=\"Annulée\",-(NETWORKDAYS.INTL(C14,E14,1,JFERIES)-D14-F14),NETWORKDAYS.INTL(C14,E14,1,JFERIES)-D14-F14))","v":1},"2013/06"]
["LOCATELLI Bruno","2013-07-01","2013-07-01",0.5,"2013-07-01",0,"CP","Acceptée",{"$f":"IF(OR(G15=\"Convention\",H15=\"Refusée\"),0,IF(H15=\"Annulée\",-(NETWORKDAYS.INTL(C15,E15,1,JFERIES)-D15-F15),NETWORKDAYS.INTL(C15,E15,1,JFERIES)-D15-F15))","v":0.5},"2013/07"]
["LOCATELLI Bruno","2013-07-01","2013-07-05",0.5,"2013-07-08",0,"CP","Acceptée",{"$f":"IF(OR(G16=\"Convention\",H16=\"Refusée\"),0,IF(H16=\"Annulée\",-(NETWORKDAYS.INTL(C16,E16,1,JFERIES)-D16-F16),NETWORKDAYS.INTL(C16,E16,1,JFERIES)-D16-F16))","v":1.5},"2013/07"]
["LOCATELLI Bruno","2013-04-08","2013-07-25",0,"2013-07-31",0,"CP","Acceptée",{"$f":"IF(OR(G17=\"Convention\",H17=\"Refusée\"),0,IF(H17=\"Annulée\",-(NETWORKDAYS.INTL(C17,E17,1,JFERIES)-D17-F17),NETWORKDAYS.INTL(C17,E17,1,JFERIES)-D17-F17))","v":5},"2013/07"]
["LOCATELLI Bruno","2013-08-01","2013-08-16",0,"2013-08-16",0,"CP","Acceptée",{"$f":"IF(OR(G18=\"Convention\",H18=\"Refusée\"),0,IF(H18=\"Annulée\",-(NETWORKDAYS.INTL(C18,E18,1,JFERIES)-D18-F18),NETWORKDAYS.INTL(C18,E18,1,JFERIES)-D18-F18))","v":1},"2013/08"]
["LOCATELLI Bruno","2013-04-08","2013-08-26",0,"2013-08-31",0,"CP","Acceptée",{"$f":"IF(OR(G19=\"Convention\",H19=\"Refusée\"),0,IF(H19=\"Annulée\",-(NETWORKDAYS.INTL(C19,E19,1,JFERIES)-D19-F19),NETWORKDAYS.INTL(C19,E19,1,JFERIES)-D19-F19))","v":5},"2013/08"]
["LOCATELLI Bruno","2013-04-08","2013-09-01",0,"2013-09-06",0,"CP","Acceptée",{"$f":"IF(OR(G20=\"Convention\",H20=\"Refusée\"),0,IF(H20=\"Annulée\",-(NETWORKDAYS.INTL(C20,E20,1,JFERIES)-D20-F20),NETWORKDAYS.INTL(C20,E20,1,JFERIES)-D20-F20))","v":5},"2013/09"]
["MARAIS Bernard","2013-05-28","2013-07-01",0,"2013-07-12",0,"CP","Acceptée",{"$f":"IF(OR(G21=\"Convention\",H21=\"Refusée\"),0,IF(H21=\"Annulée\",-(NETWORKDAYS.INTL(C21,E21,1,JFERIES)-D21-F21),NETWORKDAYS.INTL(C21,E21,1,JFERIES)-D21-F21))","v":10},"2013/07","g.bearzatto"]
["PONS Olivier","2013-05-28","2013-07-29",0,"2013-07-31",0,"CP","Acceptée",{"$f":"IF(OR(G22=\"Convention\",H22=\"Refusée\"),0,IF(H22=\"Annulée\",-(NETWORKDAYS.INTL(C22,E22,1,JFERIES)-D22-F22),NETWORKDAYS.INTL(C22,E22,1,JFERIES)-D22-F22))","v":3},"2013/07"]
["PONS Olivier","2013-05-28","2013-08-01",0,"2013-08-19",0,"CP","Acceptée",{"$f":"IF(OR(G23=\"Convention\",H23=\"Refusée\"),0,IF(H23=\"Annulée\",-(NETWORKDAYS.INTL(C23,E23,1,JFERIES)-D23-F23),NETWORKDAYS.INTL(C23,E23,1,JFERIES)-D23-F23))","v":12},"2013/08"]
["SANTUCCI Lionel","2013-05-28","2013-07-29",0,"2013-07-31",0,"CP","Acceptée",{"$f":"IF(OR(G24=\"Convention\",H24=\"Refusée\"),0,IF(H24=\"Annulée\",-(NETWORKDAYS.INTL(C24,E24,1,JFERIES)-D24-F24),NETWORKDAYS.INTL(C24,E24,1,JFERIES)-D24-F24))","v":3},"2013/07"]
["SANTUCCI Lionel","2013-05-28","2013-08-01",0,"2013-08-19",0,"CP","Acceptée",{"$f":"IF(OR(G25=\"Convention\",H25=\"Refusée\"),0,IF(H25=\"Annulée\",-(NETWORKDAYS.INTL(C25,E25,1,JFERIES)-D25-F25),NETWORKDAYS.INTL(C25,E25,1,JFERIES)-D25-F25))","v":12},"2013/08"]
["VAUTRAIN Franck","2013-06-03","2013-06-14",0.5,"2013-06-17",0,"CP","Acceptée",{"$f":"IF(OR(G26=\"Convention\",H26=\"Refusée\"),0,IF(H26=\"Annulée\",-(NETWORKDAYS.INTL(C26,E26,1,JFERIES)-D26-F26),NETWORKDAYS.INTL(C26,E26,1,JFERIES)-D26-F26))","v":1.5},"2013/06"]
["VAUTRAIN Franck","2013-06-03","2013-06-05",0.5,"2013-06-05",0,"CP","Acceptée",{"$f":"IF(OR(G27=\"Convention\",H27=\"Refusée\"),0,IF(H27=\"Annulée\",-(NETWORKDAYS.INTL(C27,E27,1,JFERIES)-D27-F27),NETWORKDAYS.INTL(C27,E27,1,JFERIES)-D27-F27))","v":0.5},"2013/06"]
["LAHAYE Laure","2013-06-03","2013-06-13",0.5,"2013-06-14",0,"CP","Acceptée",{"$f":"IF(OR(G28=\"Convention\",H28=\"Refusée\"),0,IF(H28=\"Annulée\",-(NETWORKDAYS.INTL(C28,E28,1,JFERIES)-D28-F28),NETWORKDAYS.INTL(C28,E28,1,JFERIES)-D28-F28))","v":1.5},"2013/06"]
["PONS Olivier","2013-06-03","2013-06-06",0,"2013-06-06",0,"CP","Acceptée",{"$f":"IF(OR(G29=\"Convention\",H29=\"Refusée\"),0,IF(H29=\"Annulée\",-(NETWORKDAYS.INTL(C29,E29,1,JFERIES)-D29-F29),NETWORKDAYS.INTL(C29,E29,1,JFERIES)-D29-F29))","v":1},"2013/06"]
["LEDANT Charles","2013-06-03","2013-06-14",0,"2013-06-17",0,"CP","Acceptée",{"$f":"IF(OR(G30=\"Convention\",H30=\"Refusée\"),0,IF(H30=\"Annulée\",-(NETWORKDAYS.INTL(C30,E30,1,JFERIES)-D30-F30),NETWORKDAYS.INTL(C30,E30,1,JFERIES)-D30-F30))","v":2},"2013/06"]
["LEDANT Charles","2013-06-03","2013-06-07",0,"2013-06-07",0,"CP","Acceptée",{"$f":"IF(OR(G31=\"Convention\",H31=\"Refusée\"),0,IF(H31=\"Annulée\",-(NETWORKDAYS.INTL(C31,E31,1,JFERIES)-D31-F31),NETWORKDAYS.INTL(C31,E31,1,JFERIES)-D31-F31))","v":1},"2013/06"]
["HAUTEBRANC Alexis","2013-06-03","2013-06-07",0,"2013-06-07",0,"CP","Acceptée",{"$f":"IF(OR(G32=\"Convention\",H32=\"Refusée\"),0,IF(H32=\"Annulée\",-(NETWORKDAYS.INTL(C32,E32,1,JFERIES)-D32-F32),NETWORKDAYS.INTL(C32,E32,1,JFERIES)-D32-F32))","v":1},"2013/06","Remplace demande du 30/05"]
["HAUTEBRANC Alexis","2013-06-03","2013-06-21",0,"2013-06-21",0,"CP","Acceptée",{"$f":"IF(OR(G33=\"Convention\",H33=\"Refusée\"),0,IF(H33=\"Annulée\",-(NETWORKDAYS.INTL(C33,E33,1,JFERIES)-D33-F33),NETWORKDAYS.INTL(C33,E33,1,JFERIES)-D33-F33))","v":1},"2013/06"]
["CHEVALIER Yohan","2013-06-03","2013-06-13",0,"2013-06-14",0,"CP","Acceptée",{"$f":"IF(OR(G34=\"Convention\",H34=\"Refusée\"),0,IF(H34=\"Annulée\",-(NETWORKDAYS.INTL(C34,E34,1,JFERIES)-D34-F34),NETWORKDAYS.INTL(C34,E34,1,JFERIES)-D34-F34))","v":2},"2013/06"]
["BELBEY Dounia","2013-05-28","2013-06-03",0,"2013-06-03",0,"RTT","Acceptée",{"$f":"IF(OR(G35=\"Convention\",H35=\"Refusée\"),0,IF(H35=\"Annulée\",-(NETWORKDAYS.INTL(C35,E35,1,JFERIES)-D35-F35),NETWORKDAYS.INTL(C35,E35,1,JFERIES)-D35-F35))","v":1},"2013/06"]
["TAQUET Alain","2013-05-29","2013-08-12",0,"2013-08-30",0,"CP","Acceptée",{"$f":"IF(OR(G36=\"Convention\",H36=\"Refusée\"),0,IF(H36=\"Annulée\",-(NETWORKDAYS.INTL(C36,E36,1,JFERIES)-D36-F36),NETWORKDAYS.INTL(C36,E36,1,JFERIES)-D36-F36))","v":14},"2013/08","a compléter"]
["DREVON Alain","2013-05-21","2013-07-22",0,"2013-07-26",0,"CP","Refusée",{"$f":"IF(OR(G37=\"Convention\",H37=\"Refusée\"),0,IF(H37=\"Annulée\",-(NETWORKDAYS.INTL(C37,E37,1,JFERIES)-D37-F37),NETWORKDAYS.INTL(C37,E37,1,JFERIES)-D37-F37))","v":0},"2013/07","Hors période autorisée"]
["BEARZATTO Giovanni","2013-06-06","2013-06-07",0.5,"2013-06-07",0,"CP","Acceptée",{"$f":"IF(OR(G38=\"Convention\",H38=\"Refusée\"),0,IF(H38=\"Annulée\",-(NETWORKDAYS.INTL(C38,E38,1,JFERIES)-D38-F38),NETWORKDAYS.INTL(C38,E38,1,JFERIES)-D38-F38))","v":0.5},"2013/06"]
["PONS Olivier","2013-06-06","2013-06-05",0,"2013-06-05",0,"CP","Acceptée",{"$f":"IF(OR(G39=\"Convention\",H39=\"Refusée\"),0,IF(H39=\"Annulée\",-(NETWORKDAYS.INTL(C39,E39,1,JFERIES)-D39-F39),NETWORKDAYS.INTL(C39,E39,1,JFERIES)-D39-F39))","v":1},"2013/06",0]
["HAUTCLOCQ Claude","2013-06-05","2013-08-01",0,"2013-08-23",0,"CP","Acceptée",{"$f":"IF(OR(G40=\"Convention\",H40=\"Refusée\"),0,IF(H40=\"Annulée\",-(NETWORKDAYS.INTL(C40,E40,1,JFERIES)-D40-F40),NETWORKDAYS.INTL(C40,E40,1,JFERIES)-D40-F40))","v":16},"2013/08"]
["HAUTCLOCQ Claude","2013-06-05","2013-08-26",0,"2013-08-27",0,"RTT","Acceptée",{"$f":"IF(OR(G41=\"Convention\",H41=\"Refusée\"),0,IF(H41=\"Annulée\",-(NETWORKDAYS.INTL(C41,E41,1,JFERIES)-D41-F41),NETWORKDAYS.INTL(C41,E41,1,JFERIES)-D41-F41))","v":2},"2013/08"]
["PLONQUET Christian","2013-06-05","2013-07-29",0,"2013-07-31",0,"CP","Acceptée",{"$f":"IF(OR(G42=\"Convention\",H42=\"Refusée\"),0,IF(H42=\"Annulée\",-(NETWORKDAYS.INTL(C42,E42,1,JFERIES)-D42-F42),NETWORKDAYS.INTL(C42,E42,1,JFERIES)-D42-F42))","v":3},"2013/07"]
["PLONQUET Christian","2013-06-05","2013-08-01",0,"2013-08-23",0,"CP","Acceptée",{"$f":"IF(OR(G43=\"Convention\",H43=\"Refusée\"),0,IF(H43=\"Annulée\",-(NETWORKDAYS.INTL(C43,E43,1,JFERIES)-D43-F43),NETWORKDAYS.INTL(C43,E43,1,JFERIES)-D43-F43))","v":16},"2013/08"]
["HEMLER Christelle","2013-06-06","2013-06-10",0,"2013-06-10",0,"CP","Acceptée",{"$f":"IF(OR(G44=\"Convention\",H44=\"Refusée\"),0,IF(H44=\"Annulée\",-(NETWORKDAYS.INTL(C44,E44,1,JFERIES)-D44-F44),NETWORKDAYS.INTL(C44,E44,1,JFERIES)-D44-F44))","v":1},"2013/06"]
["HEMLER Christelle","2013-06-06","2013-06-17",0,"2013-06-17",0,"CP","Acceptée",{"$f":"IF(OR(G45=\"Convention\",H45=\"Refusée\"),0,IF(H45=\"Annulée\",-(NETWORKDAYS.INTL(C45,E45,1,JFERIES)-D45-F45),NETWORKDAYS.INTL(C45,E45,1,JFERIES)-D45-F45))","v":1},"2013/06"]
["HEMLER Christelle","2013-06-06","2013-06-26",0,"2013-06-26",0,"CP","Acceptée",{"$f":"IF(OR(G46=\"Convention\",H46=\"Refusée\"),0,IF(H46=\"Annulée\",-(NETWORKDAYS.INTL(C46,E46,1,JFERIES)-D46-F46),NETWORKDAYS.INTL(C46,E46,1,JFERIES)-D46-F46))","v":1},"2013/06"]
["HEMLER Christelle","2013-06-06","2013-07-01",0,"2013-07-01",0,"CP","Acceptée",{"$f":"IF(OR(G47=\"Convention\",H47=\"Refusée\"),0,IF(H47=\"Annulée\",-(NETWORKDAYS.INTL(C47,E47,1,JFERIES)-D47-F47),NETWORKDAYS.INTL(C47,E47,1,JFERIES)-D47-F47))","v":1},"2013/07"]
["HEMLER Christelle","2013-06-06","2013-07-24",0,"2013-07-24",0,"CP","Acceptée",{"$f":"IF(OR(G48=\"Convention\",H48=\"Refusée\"),0,IF(H48=\"Annulée\",-(NETWORKDAYS.INTL(C48,E48,1,JFERIES)-D48-F48),NETWORKDAYS.INTL(C48,E48,1,JFERIES)-D48-F48))","v":1},"2013/07"]
["HEMLER Christelle","2013-06-06","2013-07-29",0,"2013-07-31",0,"CP","Acceptée",{"$f":"IF(OR(G49=\"Convention\",H49=\"Refusée\"),0,IF(H49=\"Annulée\",-(NETWORKDAYS.INTL(C49,E49,1,JFERIES)-D49-F49),NETWORKDAYS.INTL(C49,E49,1,JFERIES)-D49-F49))","v":3},"2013/07"]
["HEMLER Christelle","2013-06-06","2013-08-01",0,"2013-08-09",0,"CP","Acceptée",{"$f":"IF(OR(G50=\"Convention\",H50=\"Refusée\"),0,IF(H50=\"Annulée\",-(NETWORKDAYS.INTL(C50,E50,1,JFERIES)-D50-F50),NETWORKDAYS.INTL(C50,E50,1,JFERIES)-D50-F50))","v":7},"2013/08"]
["HEMLER Christelle","2013-06-06","2013-09-02",0,"2013-09-06",0,"CP","Acceptée",{"$f":"IF(OR(G51=\"Convention\",H51=\"Refusée\"),0,IF(H51=\"Annulée\",-(NETWORKDAYS.INTL(C51,E51,1,JFERIES)-D51-F51),NETWORKDAYS.INTL(C51,E51,1,JFERIES)-D51-F51))","v":5},"2013/09"]
["DEREPPE Bruno","2013-06-06","2013-06-07",0,"2013-06-07",0,"CP","Acceptée",{"$f":"IF(OR(G52=\"Convention\",H52=\"Refusée\"),0,IF(H52=\"Annulée\",-(NETWORKDAYS.INTL(C52,E52,1,JFERIES)-D52-F52),NETWORKDAYS.INTL(C52,E52,1,JFERIES)-D52-F52))","v":1},"2013/06"]
["DEREPPE Bruno","2013-06-06","2013-07-25",0,"2013-07-31",0,"CP","Acceptée",{"$f":"IF(OR(G53=\"Convention\",H53=\"Refusée\"),0,IF(H53=\"Annulée\",-(NETWORKDAYS.INTL(C53,E53,1,JFERIES)-D53-F53),NETWORKDAYS.INTL(C53,E53,1,JFERIES)-D53-F53))","v":5},"2013/07"]
["DEREPPE Bruno","2013-06-06","2013-08-01",0,"2013-08-19",0,"CP","Acceptée",{"$f":"IF(OR(G54=\"Convention\",H54=\"Refusée\"),0,IF(H54=\"Annulée\",-(NETWORKDAYS.INTL(C54,E54,1,JFERIES)-D54-F54),NETWORKDAYS.INTL(C54,E54,1,JFERIES)-D54-F54))","v":12},"2013/08"]
["MARZOUK Sami","2013-06-06","2013-07-29",0,"2013-07-31",0,"CP","Acceptée",{"$f":"IF(OR(G55=\"Convention\",H55=\"Refusée\"),0,IF(H55=\"Annulée\",-(NETWORKDAYS.INTL(C55,E55,1,JFERIES)-D55-F55),NETWORKDAYS.INTL(C55,E55,1,JFERIES)-D55-F55))","v":3},"2013/07"]
["MARZOUK Sami","2013-06-06","2013-08-01",0,"2013-08-30",0,"CP","Acceptée",{"$f":"IF(OR(G56=\"Convention\",H56=\"Refusée\"),0,IF(H56=\"Annulée\",-(NETWORKDAYS.INTL(C56,E56,1,JFERIES)-D56-F56),NETWORKDAYS.INTL(C56,E56,1,JFERIES)-D56-F56))","v":21},"2013/08"]
["POMMERELL Patrick","2013-06-04","2013-06-04",0,"2013-06-04",0,"CP","Acceptée",{"$f":"IF(OR(G57=\"Convention\",H57=\"Refusée\"),0,IF(H57=\"Annulée\",-(NETWORKDAYS.INTL(C57,E57,1,JFERIES)-D57-F57),NETWORKDAYS.INTL(C57,E57,1,JFERIES)-D57-F57))","v":1},"2013/06"]
["POMMERELL Patrick","2013-06-04","2013-06-07",0.5,"2013-06-10",0,"CP","Acceptée",{"$f":"IF(OR(G58=\"Convention\",H58=\"Refusée\"),0,IF(H58=\"Annulée\",-(NETWORKDAYS.INTL(C58,E58,1,JFERIES)-D58-F58),NETWORKDAYS.INTL(C58,E58,1,JFERIES)-D58-F58))","v":1.5},"2013/06"]
["POMMERELL Patrick","2013-06-06","2013-08-05",0,"2013-08-16",0,"CP","Acceptée",{"$f":"IF(OR(G59=\"Convention\",H59=\"Refusée\"),0,IF(H59=\"Annulée\",-(NETWORKDAYS.INTL(C59,E59,1,JFERIES)-D59-F59),NETWORKDAYS.INTL(C59,E59,1,JFERIES)-D59-F59))","v":9},"2013/08"]
["BEARZATTO Giovanni","2013-06-06","2013-06-24",0,"2013-06-24",0,"RTT","Acceptée",{"$f":"IF(OR(G60=\"Convention\",H60=\"Refusée\"),0,IF(H60=\"Annulée\",-(NETWORKDAYS.INTL(C60,E60,1,JFERIES)-D60-F60),NETWORKDAYS.INTL(C60,E60,1,JFERIES)-D60-F60))","v":1},"2013/06"]
["BEARZATTO Giovanni","2013-06-06","2013-08-16",0,"2013-08-16",0,"RTT","Acceptée",{"$f":"IF(OR(G61=\"Convention\",H61=\"Refusée\"),0,IF(H61=\"Annulée\",-(NETWORKDAYS.INTL(C61,E61,1,JFERIES)-D61-F61),NETWORKDAYS.INTL(C61,E61,1,JFERIES)-D61-F61))","v":1},"2013/08"]
["BEARZATTO Giovanni","2013-06-06","2013-08-19",0,"2013-08-31",0,"CP","Acceptée",{"$f":"IF(OR(G62=\"Convention\",H62=\"Refusée\"),0,IF(H62=\"Annulée\",-(NETWORKDAYS.INTL(C62,E62,1,JFERIES)-D62-F62),NETWORKDAYS.INTL(C62,E62,1,JFERIES)-D62-F62))","v":10},"2013/08"]
["BEARZATTO Giovanni","2013-06-06","2013-09-01",0,"2013-09-09",0,"CP","Acceptée",{"$f":"IF(OR(G63=\"Convention\",H63=\"Refusée\"),0,IF(H63=\"Annulée\",-(NETWORKDAYS.INTL(C63,E63,1,JFERIES)-D63-F63),NETWORKDAYS.INTL(C63,E63,1,JFERIES)-D63-F63))","v":6},"2013/09"]
["DREZET Olivier","2013-06-12","2013-06-14",0,"2013-06-14",0,"CP","Acceptée",{"$f":"IF(OR(G64=\"Convention\",H64=\"Refusée\"),0,IF(H64=\"Annulée\",-(NETWORKDAYS.INTL(C64,E64,1,JFERIES)-D64-F64),NETWORKDAYS.INTL(C64,E64,1,JFERIES)-D64-F64))","v":1},"2013/06"]
["DREZET Olivier","2013-05-31","2013-08-05",0,"2013-08-23",0,"CP","Acceptée",{"$f":"IF(OR(G65=\"Convention\",H65=\"Refusée\"),0,IF(H65=\"Annulée\",-(NETWORKDAYS.INTL(C65,E65,1,JFERIES)-D65-F65),NETWORKDAYS.INTL(C65,E65,1,JFERIES)-D65-F65))","v":14},"2013/08"]
["GUIOT Fabien","2013-06-03","2013-06-03",0,"2013-06-04",0,"CP","Acceptée",{"$f":"IF(OR(G66=\"Convention\",H66=\"Refusée\"),0,IF(H66=\"Annulée\",-(NETWORKDAYS.INTL(C66,E66,1,JFERIES)-D66-F66),NETWORKDAYS.INTL(C66,E66,1,JFERIES)-D66-F66))","v":2},"2013/06","31/05 passé sur juin"]
["PONS Olivier","2013-06-10","2013-06-13",0,"2013-06-14",0,"CP","Acceptée",{"$f":"IF(OR(G67=\"Convention\",H67=\"Refusée\"),0,IF(H67=\"Annulée\",-(NETWORKDAYS.INTL(C67,E67,1,JFERIES)-D67-F67),NETWORKDAYS.INTL(C67,E67,1,JFERIES)-D67-F67))","v":2},"2013/06"]
["PONS Olivier","2013-06-07","2013-06-07",0,"2013-06-07",0,"CP","Acceptée",{"$f":"IF(OR(G68=\"Convention\",H68=\"Refusée\"),0,IF(H68=\"Annulée\",-(NETWORKDAYS.INTL(C68,E68,1,JFERIES)-D68-F68),NETWORKDAYS.INTL(C68,E68,1,JFERIES)-D68-F68))","v":1},"2013/06"]
["LAHAYE Laure","2013-06-11","2013-07-09",0.5,"2013-07-09",0,"RTT","Acceptée",{"$f":"IF(OR(G69=\"Convention\",H69=\"Refusée\"),0,IF(H69=\"Annulée\",-(NETWORKDAYS.INTL(C69,E69,1,JFERIES)-D69-F69),NETWORKDAYS.INTL(C69,E69,1,JFERIES)-D69-F69))","v":0.5},"2013/07"]
["BELBEY Dounia","2013-06-13","2013-06-25",0.5,"2013-06-25",0,"CP","Acceptée",{"$f":"IF(OR(G70=\"Convention\",H70=\"Refusée\"),0,IF(H70=\"Annulée\",-(NETWORKDAYS.INTL(C70,E70,1,JFERIES)-D70-F70),NETWORKDAYS.INTL(C70,E70,1,JFERIES)-D70-F70))","v":0.5},"2013/06"]
["GUERIN Viviane","2013-05-30","2013-01-31",0,"2013-01-31",0,"RTT","Acceptée",{"$f":"IF(OR(G71=\"Convention\",H71=\"Refusée\"),0,IF(H71=\"Annulée\",-(NETWORKDAYS.INTL(C71,E71,1,JFERIES)-D71-F71),NETWORKDAYS.INTL(C71,E71,1,JFERIES)-D71-F71))","v":1},"2013/01"]
["GUERIN Viviane","2013-05-30","2013-03-28",0,"2013-03-28",0,"RTT","Acceptée",{"$f":"IF(OR(G72=\"Convention\",H72=\"Refusée\"),0,IF(H72=\"Annulée\",-(NETWORKDAYS.INTL(C72,E72,1,JFERIES)-D72-F72),NETWORKDAYS.INTL(C72,E72,1,JFERIES)-D72-F72))","v":1},"2013/03"]
["GUERIN Viviane","2013-10-18","2013-11-04",0,"2013-11-04",0,"RTT","Acceptée",{"$f":"IF(OR(G73=\"Convention\",H73=\"Refusée\"),0,IF(H73=\"Annulée\",-(NETWORKDAYS.INTL(C73,E73,1,JFERIES)-D73-F73),NETWORKDAYS.INTL(C73,E73,1,JFERIES)-D73-F73))","v":1},"2013/11","remplacemt du 25/11 initialement prévu"]
["GUERIN Viviane","2013-06-14","2013-07-15",0,"2013-07-15",0,"RTT","Acceptée",{"$f":"IF(OR(G74=\"Convention\",H74=\"Refusée\"),0,IF(H74=\"Annulée\",-(NETWORKDAYS.INTL(C74,E74,1,JFERIES)-D74-F74),NETWORKDAYS.INTL(C74,E74,1,JFERIES)-D74-F74))","v":1},"2013/07"]
["COUTANT Jean Paul","2013-06-19","2013-06-28",0,"2013-06-28",0.5,"CP","Acceptée",{"$f":"IF(OR(G75=\"Convention\",H75=\"Refusée\"),0,IF(H75=\"Annulée\",-(NETWORKDAYS.INTL(C75,E75,1,JFERIES)-D75-F75),NETWORKDAYS.INTL(C75,E75,1,JFERIES)-D75-F75))","v":0.5},"2013/06"]
["COUTANT Jean Paul","2013-06-19","2013-07-12",0.5,"2013-07-15",0,"CP","Acceptée",{"$f":"IF(OR(G76=\"Convention\",H76=\"Refusée\"),0,IF(H76=\"Annulée\",-(NETWORKDAYS.INTL(C76,E76,1,JFERIES)-D76-F76),NETWORKDAYS.INTL(C76,E76,1,JFERIES)-D76-F76))","v":1.5},"2013/07"]
["GUINOT Nathalie","2013-06-05","2013-06-05",0,"2013-06-05",0,"CP","Acceptée",{"$f":"IF(OR(G77=\"Convention\",H77=\"Refusée\"),0,IF(H77=\"Annulée\",-(NETWORKDAYS.INTL(C77,E77,1,JFERIES)-D77-F77),NETWORKDAYS.INTL(C77,E77,1,JFERIES)-D77-F77))","v":1},"2013/06"]
["GUINOT Nathalie","2013-06-05","2013-06-12",0,"2013-06-12",0,"CP","Acceptée",{"$f":"IF(OR(G78=\"Convention\",H78=\"Refusée\"),0,IF(H78=\"Annulée\",-(NETWORKDAYS.INTL(C78,E78,1,JFERIES)-D78-F78),NETWORKDAYS.INTL(C78,E78,1,JFERIES)-D78-F78))","v":1},"2013/06"]
["GUINOT Nathalie","2013-06-05","2013-06-19",0,"2013-06-19",0,"CP","Acceptée",{"$f":"IF(OR(G79=\"Convention\",H79=\"Refusée\"),0,IF(H79=\"Annulée\",-(NETWORKDAYS.INTL(C79,E79,1,JFERIES)-D79-F79),NETWORKDAYS.INTL(C79,E79,1,JFERIES)-D79-F79))","v":1},"2013/06"]
["GUINOT Nathalie","2013-06-20","2013-07-17",0,"2013-07-17",0,"CP","Acceptée",{"$f":"IF(OR(G80=\"Convention\",H80=\"Refusée\"),0,IF(H80=\"Annulée\",-(NETWORKDAYS.INTL(C80,E80,1,JFERIES)-D80-F80),NETWORKDAYS.INTL(C80,E80,1,JFERIES)-D80-F80))","v":1},"2013/07"]
["GUINOT Nathalie","2013-06-20","2013-07-02",0,"2013-07-02",0,"CP","Acceptée",{"$f":"IF(OR(G81=\"Convention\",H81=\"Refusée\"),0,IF(H81=\"Annulée\",-(NETWORKDAYS.INTL(C81,E81,1,JFERIES)-D81-F81),NETWORKDAYS.INTL(C81,E81,1,JFERIES)-D81-F81))","v":1},"2013/07"]
["GUINOT Nathalie","2013-06-21","2013-08-12",0,"2013-08-30",0,"CP","Acceptée",{"$f":"IF(OR(G82=\"Convention\",H82=\"Refusée\"),0,IF(H82=\"Annulée\",-(NETWORKDAYS.INTL(C82,E82,1,JFERIES)-D82-F82),NETWORKDAYS.INTL(C82,E82,1,JFERIES)-D82-F82))","v":14},"2013/08"]
["ROBIN Kevin","2013-06-20","2013-08-12",0,"2013-08-30",0,"CP","Acceptée",{"$f":"IF(OR(G83=\"Convention\",H83=\"Refusée\"),0,IF(H83=\"Annulée\",-(NETWORKDAYS.INTL(C83,E83,1,JFERIES)-D83-F83),NETWORKDAYS.INTL(C83,E83,1,JFERIES)-D83-F83))","v":14},"2013/08"]
["SOUCHET Alain","2013-06-21","2013-08-05",0,"2013-08-31",0,"CP","Acceptée",{"$f":"IF(OR(G84=\"Convention\",H84=\"Refusée\"),0,IF(H84=\"Annulée\",-(NETWORKDAYS.INTL(C84,E84,1,JFERIES)-D84-F84),NETWORKDAYS.INTL(C84,E84,1,JFERIES)-D84-F84))","v":19},"2013/08"]
["SOUCHET Alain","2013-06-21","2013-09-01",0,"2013-09-02",0,"CP","Acceptée",{"$f":"IF(OR(G85=\"Convention\",H85=\"Refusée\"),0,IF(H85=\"Annulée\",-(NETWORKDAYS.INTL(C85,E85,1,JFERIES)-D85-F85),NETWORKDAYS.INTL(C85,E85,1,JFERIES)-D85-F85))","v":1},"2013/09"]
["SIODMAK Eric","2013-06-27","2013-08-12",0,"2013-08-31",0,"CP","Acceptée",{"$f":"IF(OR(G86=\"Convention\",H86=\"Refusée\"),0,IF(H86=\"Annulée\",-(NETWORKDAYS.INTL(C86,E86,1,JFERIES)-D86-F86),NETWORKDAYS.INTL(C86,E86,1,JFERIES)-D86-F86))","v":14},"2013/08"]
["SIODMAK Eric","2013-06-27","2013-09-01",0,"2013-09-02",0,"CP","Acceptée",{"$f":"IF(OR(G87=\"Convention\",H87=\"Refusée\"),0,IF(H87=\"Annulée\",-(NETWORKDAYS.INTL(C87,E87,1,JFERIES)-D87-F87),NETWORKDAYS.INTL(C87,E87,1,JFERIES)-D87-F87))","v":1},"2013/09"]
["SIODMAK Eric","2013-06-27","2013-08-09",0,"2013-08-09",0,"RTT","Acceptée",{"$f":"IF(OR(G88=\"Convention\",H88=\"Refusée\"),0,IF(H88=\"Annulée\",-(NETWORKDAYS.INTL(C88,E88,1,JFERIES)-D88-F88),NETWORKDAYS.INTL(C88,E88,1,JFERIES)-D88-F88))","v":1},"2013/08"]
["KADEM Christophe","2013-06-24","2013-07-09",0,"2013-07-09",0,"RTT","Acceptée",{"$f":"IF(OR(G89=\"Convention\",H89=\"Refusée\"),0,IF(H89=\"Annulée\",-(NETWORKDAYS.INTL(C89,E89,1,JFERIES)-D89-F89),NETWORKDAYS.INTL(C89,E89,1,JFERIES)-D89-F89))","v":1},"2013/07"]
["KADEM Christophe","2013-06-24","2013-07-08",0,"2013-07-08",0.5,"CP","Acceptée",{"$f":"IF(OR(G90=\"Convention\",H90=\"Refusée\"),0,IF(H90=\"Annulée\",-(NETWORKDAYS.INTL(C90,E90,1,JFERIES)-D90-F90),NETWORKDAYS.INTL(C90,E90,1,JFERIES)-D90-F90))","v":0.5},"2013/07"]
["KADEM Christophe","2013-06-24","2013-07-26",0,"2013-07-31",0,"CP","Acceptée",{"$f":"IF(OR(G91=\"Convention\",H91=\"Refusée\"),0,IF(H91=\"Annulée\",-(NETWORKDAYS.INTL(C91,E91,1,JFERIES)-D91-F91),NETWORKDAYS.INTL(C91,E91,1,JFERIES)-D91-F91))","v":4},"2013/07"]
["KADEM Christophe","2013-06-24","2013-08-01",0,"2013-08-18",0,"CP","Acceptée",{"$f":"IF(OR(G92=\"Convention\",H92=\"Refusée\"),0,IF(H92=\"Annulée\",-(NETWORKDAYS.INTL(C92,E92,1,JFERIES)-D92-F92),NETWORKDAYS.INTL(C92,E92,1,JFERIES)-D92-F92))","v":11},"2013/08"]
["CHEVALIER Yohan","2013-06-06","2013-08-16",0,"2013-08-30",0,"CP","Acceptée",{"$f":"IF(OR(G93=\"Convention\",H93=\"Refusée\"),0,IF(H93=\"Annulée\",-(NETWORKDAYS.INTL(C93,E93,1,JFERIES)-D93-F93),NETWORKDAYS.INTL(C93,E93,1,JFERIES)-D93-F93))","v":11},"2013/08"]
["MARAIS Bernard","2013-07-01","2013-09-02",0,"2013-09-06",0,"CP","Acceptée",{"$f":"IF(OR(G94=\"Convention\",H94=\"Refusée\"),0,IF(H94=\"Annulée\",-(NETWORKDAYS.INTL(C94,E94,1,JFERIES)-D94-F94),NETWORKDAYS.INTL(C94,E94,1,JFERIES)-D94-F94))","v":5},"2013/09"]
["GUINOT Nathalie","2013-06-20","2013-07-10",0,"2013-07-10",0,"CP","Acceptée",{"$f":"IF(OR(G95=\"Convention\",H95=\"Refusée\"),0,IF(H95=\"Annulée\",-(NETWORKDAYS.INTL(C95,E95,1,JFERIES)-D95-F95),NETWORKDAYS.INTL(C95,E95,1,JFERIES)-D95-F95))","v":1},"2013/07"]
["SANTUCCI Lionel","2013-06-26","2013-07-19",0,"2013-07-19",0,"RTT","Acceptée",{"$f":"IF(OR(G96=\"Convention\",H96=\"Refusée\"),0,IF(H96=\"Annulée\",-(NETWORKDAYS.INTL(C96,E96,1,JFERIES)-D96-F96),NETWORKDAYS.INTL(C96,E96,1,JFERIES)-D96-F96))","v":1},"2013/07"]
["CHEVALIER Yohan","2013-06-26","2013-07-05",0,"2013-07-05",0,"CP","Acceptée",{"$f":"IF(OR(G97=\"Convention\",H97=\"Refusée\"),0,IF(H97=\"Annulée\",-(NETWORKDAYS.INTL(C97,E97,1,JFERIES)-D97-F97),NETWORKDAYS.INTL(C97,E97,1,JFERIES)-D97-F97))","v":1},"2013/07"]
["LOYER Michel","2013-07-01","2013-07-29",0,"2013-07-31",0,"CP","Acceptée",{"$f":"IF(OR(G98=\"Convention\",H98=\"Refusée\"),0,IF(H98=\"Annulée\",-(NETWORKDAYS.INTL(C98,E98,1,JFERIES)-D98-F98),NETWORKDAYS.INTL(C98,E98,1,JFERIES)-D98-F98))","v":3},"2013/07"]
["LOYER Michel","2013-07-01","2013-08-01",0,"2013-08-19",0,"CP","Acceptée",{"$f":"IF(OR(G99=\"Convention\",H99=\"Refusée\"),0,IF(H99=\"Annulée\",-(NETWORKDAYS.INTL(C99,E99,1,JFERIES)-D99-F99),NETWORKDAYS.INTL(C99,E99,1,JFERIES)-D99-F99))","v":12},"2013/08"]
["GUERIN Viviane","2013-06-01","2013-06-03",0,"2013-06-03",0,"CP","Acceptée",{"$f":"IF(OR(G100=\"Convention\",H100=\"Refusée\"),0,IF(H100=\"Annulée\",-(NETWORKDAYS.INTL(C100,E100,1,JFERIES)-D100-F100),NETWORKDAYS.INTL(C100,E100,1,JFERIES)-D100-F100))","v":1},"2013/06"]
["GUERIN Viviane","2013-07-01","2013-07-12",0,"2013-07-12",0,"CP","Acceptée",{"$f":"IF(OR(G101=\"Convention\",H101=\"Refusée\"),0,IF(H101=\"Annulée\",-(NETWORKDAYS.INTL(C101,E101,1,JFERIES)-D101-F101),NETWORKDAYS.INTL(C101,E101,1,JFERIES)-D101-F101))","v":1},"2013/07"]
["GUERIN Viviane","2013-07-01","2013-07-26",0,"2013-07-26",0,"CP","Acceptée",{"$f":"IF(OR(G102=\"Convention\",H102=\"Refusée\"),0,IF(H102=\"Annulée\",-(NETWORKDAYS.INTL(C102,E102,1,JFERIES)-D102-F102),NETWORKDAYS.INTL(C102,E102,1,JFERIES)-D102-F102))","v":1},"2013/07"]
["HAUTEBRANC Alexis","2013-06-24","2013-07-05",0,"2013-07-05",0,"RTT","Acceptée",{"$f":"IF(OR(G103=\"Convention\",H103=\"Refusée\"),0,IF(H103=\"Annulée\",-(NETWORKDAYS.INTL(C103,E103,1,JFERIES)-D103-F103),NETWORKDAYS.INTL(C103,E103,1,JFERIES)-D103-F103))","v":1},"2013/07"]
["DREVON Alain","2013-06-25","2013-09-01",0,"2013-09-06",0,"CP","Acceptée",{"$f":"IF(OR(G104=\"Convention\",H104=\"Refusée\"),0,IF(H104=\"Annulée\",-(NETWORKDAYS.INTL(C104,E104,1,JFERIES)-D104-F104),NETWORKDAYS.INTL(C104,E104,1,JFERIES)-D104-F104))","v":5},"2013/09"]
["HAUTEBRANC Alexis","2013-07-01","2013-07-29",0,"2013-07-31",0,"CP","Acceptée",{"$f":"IF(OR(G105=\"Convention\",H105=\"Refusée\"),0,IF(H105=\"Annulée\",-(NETWORKDAYS.INTL(C105,E105,1,JFERIES)-D105-F105),NETWORKDAYS.INTL(C105,E105,1,JFERIES)-D105-F105))","v":3},"2013/07"]
["HAUTEBRANC Alexis","2013-07-01","2013-08-01",0,"2013-08-09",0,"CP","Acceptée",{"$f":"IF(OR(G106=\"Convention\",H106=\"Refusée\"),0,IF(H106=\"Annulée\",-(NETWORKDAYS.INTL(C106,E106,1,JFERIES)-D106-F106),NETWORKDAYS.INTL(C106,E106,1,JFERIES)-D106-F106))","v":7},"2013/08"]
["HAUTEBRANC Alexis","2013-07-01","2013-08-14",0,"2013-08-16",0,"CP","Acceptée",{"$f":"IF(OR(G107=\"Convention\",H107=\"Refusée\"),0,IF(H107=\"Annulée\",-(NETWORKDAYS.INTL(C107,E107,1,JFERIES)-D107-F107),NETWORKDAYS.INTL(C107,E107,1,JFERIES)-D107-F107))","v":2},"2013/08"]
["BELBEY Dounia","2013-07-01","2013-07-02",0,"2013-07-02",0.5,"RTT","Acceptée",{"$f":"IF(OR(G108=\"Convention\",H108=\"Refusée\"),0,IF(H108=\"Annulée\",-(NETWORKDAYS.INTL(C108,E108,1,JFERIES)-D108-F108),NETWORKDAYS.INTL(C108,E108,1,JFERIES)-D108-F108))","v":0.5},"2013/07"]
["DEREPPE Bruno","2013-04-16","2013-09-02",0,"2013-09-06",0,"CP","Acceptée",{"$f":"IF(OR(G109=\"Convention\",H109=\"Refusée\"),0,IF(H109=\"Annulée\",-(NETWORKDAYS.INTL(C109,E109,1,JFERIES)-D109-F109),NETWORKDAYS.INTL(C109,E109,1,JFERIES)-D109-F109))","v":5},"2013/09"]
["COUTANT Jean Paul","2013-07-01","2013-08-12",0,"2013-08-31",0,"CP","Acceptée",{"$f":"IF(OR(G110=\"Convention\",H110=\"Refusée\"),0,IF(H110=\"Annulée\",-(NETWORKDAYS.INTL(C110,E110,1,JFERIES)-D110-F110),NETWORKDAYS.INTL(C110,E110,1,JFERIES)-D110-F110))","v":14},"2013/08"]
["COUTANT Jean Paul","2013-07-01","2013-09-01",0,"2013-09-02",0,"CP","Acceptée",{"$f":"IF(OR(G111=\"Convention\",H111=\"Refusée\"),0,IF(H111=\"Annulée\",-(NETWORKDAYS.INTL(C111,E111,1,JFERIES)-D111-F111),NETWORKDAYS.INTL(C111,E111,1,JFERIES)-D111-F111))","v":1},"2013/09"]
["LAZZARO Fabien","2013-07-01","2013-07-26",0,"2013-07-31",0,"CP","Acceptée",{"$f":"IF(OR(G112=\"Convention\",H112=\"Refusée\"),0,IF(H112=\"Annulée\",-(NETWORKDAYS.INTL(C112,E112,1,JFERIES)-D112-F112),NETWORKDAYS.INTL(C112,E112,1,JFERIES)-D112-F112))","v":4},"2013/07"]
["LAZZARO Fabien","2013-07-01","2013-08-01",0,"2013-08-09",0,"CP","Acceptée",{"$f":"IF(OR(G113=\"Convention\",H113=\"Refusée\"),0,IF(H113=\"Annulée\",-(NETWORKDAYS.INTL(C113,E113,1,JFERIES)-D113-F113),NETWORKDAYS.INTL(C113,E113,1,JFERIES)-D113-F113))","v":7},"2013/08"]
["LAZZARO Fabien","2013-07-01","2013-09-02",0,"2013-09-09",0,"CP","Acceptée",{"$f":"IF(OR(G114=\"Convention\",H114=\"Refusée\"),0,IF(H114=\"Annulée\",-(NETWORKDAYS.INTL(C114,E114,1,JFERIES)-D114-F114),NETWORKDAYS.INTL(C114,E114,1,JFERIES)-D114-F114))","v":6},"2013/09"]
["GIRAUDON Alain","2013-07-01","2013-08-05",0,"2013-08-31",0,"CP","Acceptée",{"$f":"IF(OR(G115=\"Convention\",H115=\"Refusée\"),0,IF(H115=\"Annulée\",-(NETWORKDAYS.INTL(C115,E115,1,JFERIES)-D115-F115),NETWORKDAYS.INTL(C115,E115,1,JFERIES)-D115-F115))","v":19},"2013/08"]
["LIOGIER Serge","2013-07-01","2013-07-29",0,"2013-07-31",0,"CP","Acceptée",{"$f":"IF(OR(G116=\"Convention\",H116=\"Refusée\"),0,IF(H116=\"Annulée\",-(NETWORKDAYS.INTL(C116,E116,1,JFERIES)-D116-F116),NETWORKDAYS.INTL(C116,E116,1,JFERIES)-D116-F116))","v":3},"2013/07"]
["LIOGIER Serge","2013-07-01","2013-08-01",0,"2013-08-19",0,"CP","Acceptée",{"$f":"IF(OR(G117=\"Convention\",H117=\"Refusée\"),0,IF(H117=\"Annulée\",-(NETWORKDAYS.INTL(C117,E117,1,JFERIES)-D117-F117),NETWORKDAYS.INTL(C117,E117,1,JFERIES)-D117-F117))","v":12},"2013/08"]
["BELBEY Dounia","2013-07-01","2013-08-08",0,"2013-08-31",0,"CP","Acceptée",{"$f":"IF(OR(G118=\"Convention\",H118=\"Refusée\"),0,IF(H118=\"Annulée\",-(NETWORKDAYS.INTL(C118,E118,1,JFERIES)-D118-F118),NETWORKDAYS.INTL(C118,E118,1,JFERIES)-D118-F118))","v":16},"2013/08"]
["GUERIN Viviane","2013-07-01","2013-08-12",0,"2013-08-31",0,"CP","Acceptée",{"$f":"IF(OR(G119=\"Convention\",H119=\"Refusée\"),0,IF(H119=\"Annulée\",-(NETWORKDAYS.INTL(C119,E119,1,JFERIES)-D119-F119),NETWORKDAYS.INTL(C119,E119,1,JFERIES)-D119-F119))","v":14},"2013/08"]
["GUIOT Fabien","2013-06-12","2013-06-14",0,"2013-06-17",0,"CP","Acceptée",{"$f":"IF(OR(G120=\"Convention\",H120=\"Refusée\"),0,IF(H120=\"Annulée\",-(NETWORKDAYS.INTL(C120,E120,1,JFERIES)-D120-F120),NETWORKDAYS.INTL(C120,E120,1,JFERIES)-D120-F120))","v":2},"2013/06"]
["GUIOT Fabien","2013-07-01","2013-08-05",0,"2013-08-23",0,"CP","Acceptée",{"$f":"IF(OR(G121=\"Convention\",H121=\"Refusée\"),0,IF(H121=\"Annulée\",-(NETWORKDAYS.INTL(C121,E121,1,JFERIES)-D121-F121),NETWORKDAYS.INTL(C121,E121,1,JFERIES)-D121-F121))","v":14},"2013/08"]
["HAUTEBRANC Alexis","2013-07-01","2013-08-26",0,"2013-08-31",0,"CP","Acceptée",{"$f":"IF(OR(G122=\"Convention\",H122=\"Refusée\"),0,IF(H122=\"Annulée\",-(NETWORKDAYS.INTL(C122,E122,1,JFERIES)-D122-F122),NETWORKDAYS.INTL(C122,E122,1,JFERIES)-D122-F122))","v":5},"2013/08"]
["HAUTEBRANC Alexis","2013-07-01","2013-09-01",0,"2013-09-03",0,"CP","Acceptée",{"$f":"IF(OR(G123=\"Convention\",H123=\"Refusée\"),0,IF(H123=\"Annulée\",-(NETWORKDAYS.INTL(C123,E123,1,JFERIES)-D123-F123),NETWORKDAYS.INTL(C123,E123,1,JFERIES)-D123-F123))","v":2},"2013/09"]
["VAUTRAIN Franck","2013-07-01","2013-08-01",0,"2013-08-23",0,"CP","Acceptée",{"$f":"IF(OR(G124=\"Convention\",H124=\"Refusée\"),0,IF(H124=\"Annulée\",-(NETWORKDAYS.INTL(C124,E124,1,JFERIES)-D124-F124),NETWORKDAYS.INTL(C124,E124,1,JFERIES)-D124-F124))","v":16},"2013/08"]
["RUBIO Isabel","2013-06-30","2013-06-07",0,"2013-06-07",0,"CP","Acceptée",{"$f":"IF(OR(G125=\"Convention\",H125=\"Refusée\"),0,IF(H125=\"Annulée\",-(NETWORKDAYS.INTL(C125,E125,1,JFERIES)-D125-F125),NETWORKDAYS.INTL(C125,E125,1,JFERIES)-D125-F125))","v":1},"2013/06"]
["RUBIO Isabel","2013-06-30","2013-06-18",0,"2013-06-18",0.5,"CP","Acceptée",{"$f":"IF(OR(G126=\"Convention\",H126=\"Refusée\"),0,IF(H126=\"Annulée\",-(NETWORKDAYS.INTL(C126,E126,1,JFERIES)-D126-F126),NETWORKDAYS.INTL(C126,E126,1,JFERIES)-D126-F126))","v":0.5},"2013/06"]
["RUBIO Isabel","2013-07-01","2013-08-02",0,"2013-08-23",0,"CP","Acceptée",{"$f":"IF(OR(G127=\"Convention\",H127=\"Refusée\"),0,IF(H127=\"Annulée\",-(NETWORKDAYS.INTL(C127,E127,1,JFERIES)-D127-F127),NETWORKDAYS.INTL(C127,E127,1,JFERIES)-D127-F127))","v":15},"2013/08"]
["DREZET Olivier","2013-07-03","2013-07-12",0,"2013-07-12",0,"CP","Acceptée",{"$f":"IF(OR(G128=\"Convention\",H128=\"Refusée\"),0,IF(H128=\"Annulée\",-(NETWORKDAYS.INTL(C128,E128,1,JFERIES)-D128-F128),NETWORKDAYS.INTL(C128,E128,1,JFERIES)-D128-F128))","v":1},"2013/07"]
["SIODMAK Eric","2013-07-05","2013-07-11",0,"2013-07-11",0,"RTT","Acceptée",{"$f":"IF(OR(G129=\"Convention\",H129=\"Refusée\"),0,IF(H129=\"Annulée\",-(NETWORKDAYS.INTL(C129,E129,1,JFERIES)-D129-F129),NETWORKDAYS.INTL(C129,E129,1,JFERIES)-D129-F129))","v":1},"2013/07"]
["HAUTCLOCQ Claude","2013-07-11","2013-07-11",0,"2013-07-11",0,"RTT","Acceptée",{"$f":"IF(OR(G130=\"Convention\",H130=\"Refusée\"),0,IF(H130=\"Annulée\",-(NETWORKDAYS.INTL(C130,E130,1,JFERIES)-D130-F130),NETWORKDAYS.INTL(C130,E130,1,JFERIES)-D130-F130))","v":1},"2013/07"]
["DREZET Olivier","2013-07-23","2013-07-26",0,"2013-07-26",0,"CP","Acceptée",{"$f":"IF(OR(G131=\"Convention\",H131=\"Refusée\"),0,IF(H131=\"Annulée\",-(NETWORKDAYS.INTL(C131,E131,1,JFERIES)-D131-F131),NETWORKDAYS.INTL(C131,E131,1,JFERIES)-D131-F131))","v":1},"2013/07"]
["PONS Olivier","2013-07-23","2013-07-26",0,"2013-07-26",0,"CP","Acceptée",{"$f":"IF(OR(G132=\"Convention\",H132=\"Refusée\"),0,IF(H132=\"Annulée\",-(NETWORKDAYS.INTL(C132,E132,1,JFERIES)-D132-F132),NETWORKDAYS.INTL(C132,E132,1,JFERIES)-D132-F132))","v":1},"2013/07"]
["LAHAYE Laure","2013-06-24","2013-06-24",0,"2013-06-24",0,"CP","Acceptée",{"$f":"IF(OR(G133=\"Convention\",H133=\"Refusée\"),0,IF(H133=\"Annulée\",-(NETWORKDAYS.INTL(C133,E133,1,JFERIES)-D133-F133),NETWORKDAYS.INTL(C133,E133,1,JFERIES)-D133-F133))","v":1},"2013/06"]
["TAQUET Alain","2013-07-26","2013-07-31",0,"2013-07-31",0,"RTT","Acceptée",{"$f":"IF(OR(G134=\"Convention\",H134=\"Refusée\"),0,IF(H134=\"Annulée\",-(NETWORKDAYS.INTL(C134,E134,1,JFERIES)-D134-F134),NETWORKDAYS.INTL(C134,E134,1,JFERIES)-D134-F134))","v":1},"2013/07"]
["DREZET Olivier","2013-07-31","2013-09-02",0,"2013-09-04",0,"CP","Acceptée",{"$f":"IF(OR(G135=\"Convention\",H135=\"Refusée\"),0,IF(H135=\"Annulée\",-(NETWORKDAYS.INTL(C135,E135,1,JFERIES)-D135-F135),NETWORKDAYS.INTL(C135,E135,1,JFERIES)-D135-F135))","v":3},"2013/09"]
["POMMERELL Patrick","2013-08-01","2013-08-19",0,"2013-08-23",0,"CP","Acceptée",{"$f":"IF(OR(G136=\"Convention\",H136=\"Refusée\"),0,IF(H136=\"Annulée\",-(NETWORKDAYS.INTL(C136,E136,1,JFERIES)-D136-F136),NETWORKDAYS.INTL(C136,E136,1,JFERIES)-D136-F136))","v":5},"2013/08"]
["KADEM Christophe","2013-09-02","2013-10-21",0,"2013-10-21",0,"RTT","Acceptée",{"$f":"IF(OR(G137=\"Convention\",H137=\"Refusée\"),0,IF(H137=\"Annulée\",-(NETWORKDAYS.INTL(C137,E137,1,JFERIES)-D137-F137),NETWORKDAYS.INTL(C137,E137,1,JFERIES)-D137-F137))","v":1},"2013/10"]
["KADEM Christophe","2013-09-02","2013-10-22",0,"2013-10-22",0,"CP","Acceptée",{"$f":"IF(OR(G138=\"Convention\",H138=\"Refusée\"),0,IF(H138=\"Annulée\",-(NETWORKDAYS.INTL(C138,E138,1,JFERIES)-D138-F138),NETWORKDAYS.INTL(C138,E138,1,JFERIES)-D138-F138))","v":1},"2013/10"]
["DREZET Olivier","2013-09-05","2013-11-08",0,"2013-11-08",0,"CP","Acceptée",{"$f":"IF(OR(G139=\"Convention\",H139=\"Refusée\"),0,IF(H139=\"Annulée\",-(NETWORKDAYS.INTL(C139,E139,1,JFERIES)-D139-F139),NETWORKDAYS.INTL(C139,E139,1,JFERIES)-D139-F139))","v":1},"2013/11"]
["BEARZATTO Giovanni","2013-09-09","2013-09-10",0,"2013-09-10",0,"RTT","Acceptée",{"$f":"IF(OR(G140=\"Convention\",H140=\"Refusée\"),0,IF(H140=\"Annulée\",-(NETWORKDAYS.INTL(C140,E140,1,JFERIES)-D140-F140),NETWORKDAYS.INTL(C140,E140,1,JFERIES)-D140-F140))","v":1},"2013/09"]
["HAUTEBRANC Alexis","2013-09-10","2013-10-04",0,"2013-10-04",0,"RTT","Acceptée",{"$f":"IF(OR(G141=\"Convention\",H141=\"Refusée\"),0,IF(H141=\"Annulée\",-(NETWORKDAYS.INTL(C141,E141,1,JFERIES)-D141-F141),NETWORKDAYS.INTL(C141,E141,1,JFERIES)-D141-F141))","v":1},"2013/10"]
["PONS Olivier","2013-08-20","2013-11-13",0,"2013-11-23",0,"CP","Refusée",{"$f":"IF(OR(G142=\"Convention\",H142=\"Refusée\"),0,IF(H142=\"Annulée\",-(NETWORKDAYS.INTL(C142,E142,1,JFERIES)-D142-F142),NETWORKDAYS.INTL(C142,E142,1,JFERIES)-D142-F142))","v":0},"2013/11","semaines qui suivent BATIMAT ! "]
["PONS Olivier","2013-09-19","2013-09-23",0,"2013-09-23",0,"RTT","Acceptée",{"$f":"IF(OR(G143=\"Convention\",H143=\"Refusée\"),0,IF(H143=\"Annulée\",-(NETWORKDAYS.INTL(C143,E143,1,JFERIES)-D143-F143),NETWORKDAYS.INTL(C143,E143,1,JFERIES)-D143-F143))","v":1},"2013/09"]
["DEREPPE Bruno","2013-09-19","2013-11-15",0.5,"2013-11-15",0,"RTT","Acceptée",{"$f":"IF(OR(G144=\"Convention\",H144=\"Refusée\"),0,IF(H144=\"Annulée\",-(NETWORKDAYS.INTL(C144,E144,1,JFERIES)-D144-F144),NETWORKDAYS.INTL(C144,E144,1,JFERIES)-D144-F144))","v":0.5},"2013/11"]
["POMMERELL Patrick","2013-09-13","2013-09-25",0,"2013-09-25",0,"RTT","Acceptée",{"$f":"IF(OR(G145=\"Convention\",H145=\"Refusée\"),0,IF(H145=\"Annulée\",-(NETWORKDAYS.INTL(C145,E145,1,JFERIES)-D145-F145),NETWORKDAYS.INTL(C145,E145,1,JFERIES)-D145-F145))","v":1},"2013/09"]
["GUIOT Fabien","2013-09-18","2013-09-19",0,"2013-09-19",0,"RTT","Acceptée",{"$f":"IF(OR(G146=\"Convention\",H146=\"Refusée\"),0,IF(H146=\"Annulée\",-(NETWORKDAYS.INTL(C146,E146,1,JFERIES)-D146-F146),NETWORKDAYS.INTL(C146,E146,1,JFERIES)-D146-F146))","v":1},"2013/09"]
["GUIOT Fabien","2013-09-18","2013-09-20",0,"2013-09-20",0,"CP","Acceptée",{"$f":"IF(OR(G147=\"Convention\",H147=\"Refusée\"),0,IF(H147=\"Annulée\",-(NETWORKDAYS.INTL(C147,E147,1,JFERIES)-D147-F147),NETWORKDAYS.INTL(C147,E147,1,JFERIES)-D147-F147))","v":1},"2013/09"]
["DREZET Olivier","2013-09-27","2013-09-27",0,"2013-09-27",0,"RTT","Acceptée",{"$f":"IF(OR(G148=\"Convention\",H148=\"Refusée\"),0,IF(H148=\"Annulée\",-(NETWORKDAYS.INTL(C148,E148,1,JFERIES)-D148-F148),NETWORKDAYS.INTL(C148,E148,1,JFERIES)-D148-F148))","v":1},"2013/09"]
["BEARZATTO Giovanni","2013-09-27","2013-09-30",0,"2013-09-30",0.5,"RTT","Acceptée",{"$f":"IF(OR(G149=\"Convention\",H149=\"Refusée\"),0,IF(H149=\"Annulée\",-(NETWORKDAYS.INTL(C149,E149,1,JFERIES)-D149-F149),NETWORKDAYS.INTL(C149,E149,1,JFERIES)-D149-F149))","v":0.5},"2013/09"]
["HEMLER Christelle","2013-10-01","2013-10-16",0,"2013-10-16",0,"RTT","Acceptée",{"$f":"IF(OR(G150=\"Convention\",H150=\"Refusée\"),0,IF(H150=\"Annulée\",-(NETWORKDAYS.INTL(C150,E150,1,JFERIES)-D150-F150),NETWORKDAYS.INTL(C150,E150,1,JFERIES)-D150-F150))","v":1},"2013/10"]
["GUINOT Nathalie","2013-10-01","2013-09-27",0,"2013-09-27",0,"RTT","Acceptée",{"$f":"IF(OR(G151=\"Convention\",H151=\"Refusée\"),0,IF(H151=\"Annulée\",-(NETWORKDAYS.INTL(C151,E151,1,JFERIES)-D151-F151),NETWORKDAYS.INTL(C151,E151,1,JFERIES)-D151-F151))","v":1},"2013/09"]
["POMMERELL Patrick","2013-10-01","2013-10-02",0.5,"2013-10-02",0,"RTT","Acceptée",{"$f":"IF(OR(G152=\"Convention\",H152=\"Refusée\"),0,IF(H152=\"Annulée\",-(NETWORKDAYS.INTL(C152,E152,1,JFERIES)-D152-F152),NETWORKDAYS.INTL(C152,E152,1,JFERIES)-D152-F152))","v":0.5},"2013/10"]
["POMMERELL Patrick","2013-10-07","2013-10-07",0.5,"2013-10-07",0,"RTT","Acceptée",{"$f":"IF(OR(G153=\"Convention\",H153=\"Refusée\"),0,IF(H153=\"Annulée\",-(NETWORKDAYS.INTL(C153,E153,1,JFERIES)-D153-F153),NETWORKDAYS.INTL(C153,E153,1,JFERIES)-D153-F153))","v":0.5},"2013/10"]
["HAUTCLOCQ Claude","2013-10-07","2013-10-29",0,"2013-10-29",0,"RTT","Acceptée",{"$f":"IF(OR(G154=\"Convention\",H154=\"Refusée\"),0,IF(H154=\"Annulée\",-(NETWORKDAYS.INTL(C154,E154,1,JFERIES)-D154-F154),NETWORKDAYS.INTL(C154,E154,1,JFERIES)-D154-F154))","v":1},"2013/10"]
["HAUTCLOCQ Claude","2013-10-07","2013-10-22",0,"2013-10-22",0,"RTT","Acceptée",{"$f":"IF(OR(G155=\"Convention\",H155=\"Refusée\"),0,IF(H155=\"Annulée\",-(NETWORKDAYS.INTL(C155,E155,1,JFERIES)-D155-F155),NETWORKDAYS.INTL(C155,E155,1,JFERIES)-D155-F155))","v":1},"2013/10"]
["TAQUET Alain","2013-10-07","2013-10-24",0,"2013-10-25",0,"RTT","Acceptée",{"$f":"IF(OR(G156=\"Convention\",H156=\"Refusée\"),0,IF(H156=\"Annulée\",-(NETWORKDAYS.INTL(C156,E156,1,JFERIES)-D156-F156),NETWORKDAYS.INTL(C156,E156,1,JFERIES)-D156-F156))","v":2},"2013/10"]
["GUIOT Fabien","2013-02-01","2013-02-15",0,"2013-02-15",0,"RTT","Acceptée",{"$f":"IF(OR(G157=\"Convention\",H157=\"Refusée\"),0,IF(H157=\"Annulée\",-(NETWORKDAYS.INTL(C157,E157,1,JFERIES)-D157-F157),NETWORKDAYS.INTL(C157,E157,1,JFERIES)-D157-F157))","v":1},"2013/02","date à préciser - info avant ce programme"]
["GUIOT Fabien","2013-10-14","2013-10-15",0,"2013-10-16",0,"RTT","Acceptée",{"$f":"IF(OR(G158=\"Convention\",H158=\"Refusée\"),0,IF(H158=\"Annulée\",-(NETWORKDAYS.INTL(C158,E158,1,JFERIES)-D158-F158),NETWORKDAYS.INTL(C158,E158,1,JFERIES)-D158-F158))","v":2},"2013/10"]
["HAUTCLOCQ Claude","2013-10-09","2013-10-24",0,"2013-10-25",0,"CP","Acceptée",{"$f":"IF(OR(G159=\"Convention\",H159=\"Refusée\"),0,IF(H159=\"Annulée\",-(NETWORKDAYS.INTL(C159,E159,1,JFERIES)-D159-F159),NETWORKDAYS.INTL(C159,E159,1,JFERIES)-D159-F159))","v":2},"2013/10"]
["COUTANT Jean Paul","2013-10-14","2013-10-16",0,"2013-10-16",0,"RTT","Acceptée",{"$f":"IF(OR(G160=\"Convention\",H160=\"Refusée\"),0,IF(H160=\"Annulée\",-(NETWORKDAYS.INTL(C160,E160,1,JFERIES)-D160-F160),NETWORKDAYS.INTL(C160,E160,1,JFERIES)-D160-F160))","v":1},"2013/10"]
["LOCATELLI Bruno","2013-10-21","2013-10-25",0,"2013-10-25",0.5,"RTT","Acceptée",{"$f":"IF(OR(G161=\"Convention\",H161=\"Refusée\"),0,IF(H161=\"Annulée\",-(NETWORKDAYS.INTL(C161,E161,1,JFERIES)-D161-F161),NETWORKDAYS.INTL(C161,E161,1,JFERIES)-D161-F161))","v":0.5},"2013/10"]
["CHEVALIER Yohan","2013-10-18","2013-11-04",0,"2013-11-04",0,"CP","Acceptée",{"$f":"IF(OR(G162=\"Convention\",H162=\"Refusée\"),0,IF(H162=\"Annulée\",-(NETWORKDAYS.INTL(C162,E162,1,JFERIES)-D162-F162),NETWORKDAYS.INTL(C162,E162,1,JFERIES)-D162-F162))","v":1},"2013/11"]
["HAUTCLOCQ Claude","2013-10-18","2013-10-28",0,"2013-10-28",0,"CP","Acceptée",{"$f":"IF(OR(G163=\"Convention\",H163=\"Refusée\"),0,IF(H163=\"Annulée\",-(NETWORKDAYS.INTL(C163,E163,1,JFERIES)-D163-F163),NETWORKDAYS.INTL(C163,E163,1,JFERIES)-D163-F163))","v":1},"2013/10"]
["LIOGIER Serge","2013-10-02","2013-10-31",0,"2013-10-31",0,"RTT","Acceptée",{"$f":"IF(OR(G164=\"Convention\",H164=\"Refusée\"),0,IF(H164=\"Annulée\",-(NETWORKDAYS.INTL(C164,E164,1,JFERIES)-D164-F164),NETWORKDAYS.INTL(C164,E164,1,JFERIES)-D164-F164))","v":1},"2013/10"]
["LOCATELLI Bruno","2013-10-14","2013-10-16",0.5,"2013-10-16",0,"RTT","Acceptée",{"$f":"IF(OR(G165=\"Convention\",H165=\"Refusée\"),0,IF(H165=\"Annulée\",-(NETWORKDAYS.INTL(C165,E165,1,JFERIES)-D165-F165),NETWORKDAYS.INTL(C165,E165,1,JFERIES)-D165-F165))","v":0.5},"2013/10"]
["DREVON Alain","2013-10-14","2013-10-31",0,"2013-10-31",0,"RTT","Acceptée",{"$f":"IF(OR(G166=\"Convention\",H166=\"Refusée\"),0,IF(H166=\"Annulée\",-(NETWORKDAYS.INTL(C166,E166,1,JFERIES)-D166-F166),NETWORKDAYS.INTL(C166,E166,1,JFERIES)-D166-F166))","v":1},"2013/10"]
["LEDANT Charles","2013-10-07","2013-10-31",0,"2013-10-31",0,"RTT","Acceptée",{"$f":"IF(OR(G167=\"Convention\",H167=\"Refusée\"),0,IF(H167=\"Annulée\",-(NETWORKDAYS.INTL(C167,E167,1,JFERIES)-D167-F167),NETWORKDAYS.INTL(C167,E167,1,JFERIES)-D167-F167))","v":1},"2013/10"]
["GIRAUDON Alain","2013-10-25","2013-10-31",0,"2013-10-31",0,"RTT","Acceptée",{"$f":"IF(OR(G168=\"Convention\",H168=\"Refusée\"),0,IF(H168=\"Annulée\",-(NETWORKDAYS.INTL(C168,E168,1,JFERIES)-D168-F168),NETWORKDAYS.INTL(C168,E168,1,JFERIES)-D168-F168))","v":1},"2013/10"]
["GUINOT Nathalie","2013-10-24","2013-10-24",0,"2013-10-24",0.5,"RTT","Acceptée",{"$f":"IF(OR(G169=\"Convention\",H169=\"Refusée\"),0,IF(H169=\"Annulée\",-(NETWORKDAYS.INTL(C169,E169,1,JFERIES)-D169-F169),NETWORKDAYS.INTL(C169,E169,1,JFERIES)-D169-F169))","v":0.5},"2013/10"]
["HEMLER Christelle","2013-10-28","2013-11-13",0,"2013-11-13",0,"RTT","Acceptée",{"$f":"IF(OR(G170=\"Convention\",H170=\"Refusée\"),0,IF(H170=\"Annulée\",-(NETWORKDAYS.INTL(C170,E170,1,JFERIES)-D170-F170),NETWORKDAYS.INTL(C170,E170,1,JFERIES)-D170-F170))","v":1},"2013/11"]
["POMMERELL Patrick","2013-10-28","2013-10-29",0,"2013-10-29",0.5,"RTT","Acceptée",{"$f":"IF(OR(G171=\"Convention\",H171=\"Refusée\"),0,IF(H171=\"Annulée\",-(NETWORKDAYS.INTL(C171,E171,1,JFERIES)-D171-F171),NETWORKDAYS.INTL(C171,E171,1,JFERIES)-D171-F171))","v":0.5},"2013/10"]
["LOCATELLI Bruno","2013-10-23","2013-11-22",0,"2013-11-22",0,"RTT","Acceptée",{"$f":"IF(OR(G172=\"Convention\",H172=\"Refusée\"),0,IF(H172=\"Annulée\",-(NETWORKDAYS.INTL(C172,E172,1,JFERIES)-D172-F172),NETWORKDAYS.INTL(C172,E172,1,JFERIES)-D172-F172))","v":1},"2013/11"]
["LOCATELLI Bruno","2013-10-23","2013-12-12",0.5,"2013-12-12",0,"RTT","Acceptée",{"$f":"IF(OR(G173=\"Convention\",H173=\"Refusée\"),0,IF(H173=\"Annulée\",-(NETWORKDAYS.INTL(C173,E173,1,JFERIES)-D173-F173),NETWORKDAYS.INTL(C173,E173,1,JFERIES)-D173-F173))","v":0.5},"2013/12"]
["DREVON Alain","2013-10-25","2013-12-06",0,"2013-12-06",0.5,"RTT","Acceptée",{"$f":"IF(OR(G174=\"Convention\",H174=\"Refusée\"),0,IF(H174=\"Annulée\",-(NETWORKDAYS.INTL(C174,E174,1,JFERIES)-D174-F174),NETWORKDAYS.INTL(C174,E174,1,JFERIES)-D174-F174))","v":0.5},"2013/12"]
["DREVON Alain","2013-10-25","2013-11-15",0,"2013-11-15",0.5,"RTT","Acceptée",{"$f":"IF(OR(G175=\"Convention\",H175=\"Refusée\"),0,IF(H175=\"Annulée\",-(NETWORKDAYS.INTL(C175,E175,1,JFERIES)-D175-F175),NETWORKDAYS.INTL(C175,E175,1,JFERIES)-D175-F175))","v":0.5},"2013/11"]
["DREVON Alain","2013-10-25","2013-12-20",0,"2013-12-20",0.5,"RTT","Acceptée",{"$f":"IF(OR(G176=\"Convention\",H176=\"Refusée\"),0,IF(H176=\"Annulée\",-(NETWORKDAYS.INTL(C176,E176,1,JFERIES)-D176-F176),NETWORKDAYS.INTL(C176,E176,1,JFERIES)-D176-F176))","v":0.5},"2013/12"]
["LOYER Michel","2013-10-12","2013-10-22",0,"2013-10-25",0,"RTT","Acceptée",{"$f":"IF(OR(G177=\"Convention\",H177=\"Refusée\"),0,IF(H177=\"Annulée\",-(NETWORKDAYS.INTL(C177,E177,1,JFERIES)-D177-F177),NETWORKDAYS.INTL(C177,E177,1,JFERIES)-D177-F177))","v":4},"2013/10"]
["LOYER Michel","2013-10-12","2013-10-28",0,"2013-10-29",0,"CP","Acceptée",{"$f":"IF(OR(G178=\"Convention\",H178=\"Refusée\"),0,IF(H178=\"Annulée\",-(NETWORKDAYS.INTL(C178,E178,1,JFERIES)-D178-F178),NETWORKDAYS.INTL(C178,E178,1,JFERIES)-D178-F178))","v":2},"2013/10"]
["SIODMAK Eric","2013-10-28","2013-10-30",0,"2013-10-30",0,"RTT","Acceptée",{"$f":"IF(OR(G179=\"Convention\",H179=\"Refusée\"),0,IF(H179=\"Annulée\",-(NETWORKDAYS.INTL(C179,E179,1,JFERIES)-D179-F179),NETWORKDAYS.INTL(C179,E179,1,JFERIES)-D179-F179))","v":1},"2013/10"]
["GUERIN Viviane","2013-10-01","2013-11-08",0,"2013-11-08",0,"RTD Recup","Acceptée",{"$f":"IF(OR(G180=\"Convention\",H180=\"Refusée\"),0,IF(H180=\"Annulée\",-(NETWORKDAYS.INTL(C180,E180,1,JFERIES)-D180-F180),NETWORKDAYS.INTL(C180,E180,1,JFERIES)-D180-F180))","v":1},"2013/11"]
["KADEM Christophe","2013-11-12","2013-11-29",0,"2013-11-29",0,"RTT","Acceptée",{"$f":"IF(OR(G181=\"Convention\",H181=\"Refusée\"),0,IF(H181=\"Annulée\",-(NETWORKDAYS.INTL(C181,E181,1,JFERIES)-D181-F181),NETWORKDAYS.INTL(C181,E181,1,JFERIES)-D181-F181))","v":1},"2013/11"]
["KADEM Christophe","2013-11-12","2013-12-09",0,"2013-12-09",0,"RTT","Acceptée",{"$f":"IF(OR(G182=\"Convention\",H182=\"Refusée\"),0,IF(H182=\"Annulée\",-(NETWORKDAYS.INTL(C182,E182,1,JFERIES)-D182-F182),NETWORKDAYS.INTL(C182,E182,1,JFERIES)-D182-F182))","v":1},"2013/12"]
["GUIOT Fabien","2013-10-28","2013-10-29",0,"2013-10-29",0,"CP","Acceptée",{"$f":"IF(OR(G183=\"Convention\",H183=\"Refusée\"),0,IF(H183=\"Annulée\",-(NETWORKDAYS.INTL(C183,E183,1,JFERIES)-D183-F183),NETWORKDAYS.INTL(C183,E183,1,JFERIES)-D183-F183))","v":1},"2013/10"]
["GUIOT Fabien","2013-10-28","2013-10-28",0,"2013-10-28",0,"RTT","Acceptée",{"$f":"IF(OR(G184=\"Convention\",H184=\"Refusée\"),0,IF(H184=\"Annulée\",-(NETWORKDAYS.INTL(C184,E184,1,JFERIES)-D184-F184),NETWORKDAYS.INTL(C184,E184,1,JFERIES)-D184-F184))","v":1},"2013/10"]
["GUIOT Fabien","2013-10-28","2013-10-29",0,"2013-10-31",0,"Convention","Acceptée",{"$f":"IF(OR(G185=\"Convention\",H185=\"Refusée\"),0,IF(H185=\"Annulée\",-(NETWORKDAYS.INTL(C185,E185,1,JFERIES)-D185-F185),NETWORKDAYS.INTL(C185,E185,1,JFERIES)-D185-F185))","v":0},"2013/10","décès du père"]
["CHEVALIER Yohan","2013-11-13","2013-12-16",0,"2013-12-16",0,"CP","Acceptée",{"$f":"IF(OR(G186=\"Convention\",H186=\"Refusée\"),0,IF(H186=\"Annulée\",-(NETWORKDAYS.INTL(C186,E186,1,JFERIES)-D186-F186),NETWORKDAYS.INTL(C186,E186,1,JFERIES)-D186-F186))","v":1},"2013/12"]
["RUBIO Isabel","2013-09-01","2013-09-20",0,"2013-09-23",0,"CP","Acceptée",{"$f":"IF(OR(G187=\"Convention\",H187=\"Refusée\"),0,IF(H187=\"Annulée\",-(NETWORKDAYS.INTL(C187,E187,1,JFERIES)-D187-F187),NETWORKDAYS.INTL(C187,E187,1,JFERIES)-D187-F187))","v":2},"2013/09"]
["RUBIO Isabel","2013-10-01","2013-10-25",0,"2013-10-29",0,"CP","Acceptée",{"$f":"IF(OR(G188=\"Convention\",H188=\"Refusée\"),0,IF(H188=\"Annulée\",-(NETWORKDAYS.INTL(C188,E188,1,JFERIES)-D188-F188),NETWORKDAYS.INTL(C188,E188,1,JFERIES)-D188-F188))","v":3},"2013/10"]
["GUERIN Viviane","2013-09-01","2013-09-02",0,"2013-09-02",0,"RTT","Acceptée",{"$f":"IF(OR(G189=\"Convention\",H189=\"Refusée\"),0,IF(H189=\"Annulée\",-(NETWORKDAYS.INTL(C189,E189,1,JFERIES)-D189-F189),NETWORKDAYS.INTL(C189,E189,1,JFERIES)-D189-F189))","v":1},"2013/09"]
["TAQUET Alain","2013-01-01","2013-01-02",0,"2013-01-02",0,"RTT","Acceptée",{"$f":"IF(OR(G190=\"Convention\",H190=\"Refusée\"),0,IF(H190=\"Annulée\",-(NETWORKDAYS.INTL(C190,E190,1,JFERIES)-D190-F190),NETWORKDAYS.INTL(C190,E190,1,JFERIES)-D190-F190))","v":1},"2013/01"]
["COUTANT Jean Paul","2013-01-01","2013-01-02",0,"2013-01-03",0,"RTT","Acceptée",{"$f":"IF(OR(G191=\"Convention\",H191=\"Refusée\"),0,IF(H191=\"Annulée\",-(NETWORKDAYS.INTL(C191,E191,1,JFERIES)-D191-F191),NETWORKDAYS.INTL(C191,E191,1,JFERIES)-D191-F191))","v":2},"2013/01"]
["PONS Olivier","2013-01-01","2013-01-11",0,"2013-01-11",0,"RTT","Acceptée",{"$f":"IF(OR(G192=\"Convention\",H192=\"Refusée\"),0,IF(H192=\"Annulée\",-(NETWORKDAYS.INTL(C192,E192,1,JFERIES)-D192-F192),NETWORKDAYS.INTL(C192,E192,1,JFERIES)-D192-F192))","v":1},"2013/01"]
["HEMLER Christelle","2013-01-01","2013-01-02",0,"2013-01-02",0,"RTT","Acceptée",{"$f":"IF(OR(G193=\"Convention\",H193=\"Refusée\"),0,IF(H193=\"Annulée\",-(NETWORKDAYS.INTL(C193,E193,1,JFERIES)-D193-F193),NETWORKDAYS.INTL(C193,E193,1,JFERIES)-D193-F193))","v":1},"2013/01"]
["PONS Olivier","2013-01-20","2013-01-21",0,"2013-01-21",0.5,"RTT","Acceptée",{"$f":"IF(OR(G194=\"Convention\",H194=\"Refusée\"),0,IF(H194=\"Annulée\",-(NETWORKDAYS.INTL(C194,E194,1,JFERIES)-D194-F194),NETWORKDAYS.INTL(C194,E194,1,JFERIES)-D194-F194))","v":0.5},"2013/01"]
["LOCATELLI Bruno","2013-01-20","2013-01-25",0,"2013-01-25",0,"RTT","Acceptée",{"$f":"IF(OR(G195=\"Convention\",H195=\"Refusée\"),0,IF(H195=\"Annulée\",-(NETWORKDAYS.INTL(C195,E195,1,JFERIES)-D195-F195),NETWORKDAYS.INTL(C195,E195,1,JFERIES)-D195-F195))","v":1},"2013/01"]
["RUBIO Isabel","2013-01-18","2013-01-18",0,"2013-01-18",0.5,"RTT","Acceptée",{"$f":"IF(OR(G196=\"Convention\",H196=\"Refusée\"),0,IF(H196=\"Annulée\",-(NETWORKDAYS.INTL(C196,E196,1,JFERIES)-D196-F196),NETWORKDAYS.INTL(C196,E196,1,JFERIES)-D196-F196))","v":0.5},"2013/01"]
["DREZET Olivier","2013-02-15","2013-02-15",0,"2013-02-15",0,"RTT","Acceptée",{"$f":"IF(OR(G197=\"Convention\",H197=\"Refusée\"),0,IF(H197=\"Annulée\",-(NETWORKDAYS.INTL(C197,E197,1,JFERIES)-D197-F197),NETWORKDAYS.INTL(C197,E197,1,JFERIES)-D197-F197))","v":1},"2013/02"]
["BEARZATTO Giovanni","2013-02-14","2013-02-14",0,"2013-02-14",0.5,"RTT","Acceptée",{"$f":"IF(OR(G198=\"Convention\",H198=\"Refusée\"),0,IF(H198=\"Annulée\",-(NETWORKDAYS.INTL(C198,E198,1,JFERIES)-D198-F198),NETWORKDAYS.INTL(C198,E198,1,JFERIES)-D198-F198))","v":0.5},"2013/02"]
["VAUTRAIN Franck","2013-02-01","2013-02-01",0,"2013-02-01",0.5,"RTT","Acceptée",{"$f":"IF(OR(G199=\"Convention\",H199=\"Refusée\"),0,IF(H199=\"Annulée\",-(NETWORKDAYS.INTL(C199,E199,1,JFERIES)-D199-F199),NETWORKDAYS.INTL(C199,E199,1,JFERIES)-D199-F199))","v":0.5},"2013/02"]
["RUBIO Isabel","2013-02-01","2013-02-01",0,"2013-02-01",0.5,"RTT","Acceptée",{"$f":"IF(OR(G200=\"Convention\",H200=\"Refusée\"),0,IF(H200=\"Annulée\",-(NETWORKDAYS.INTL(C200,E200,1,JFERIES)-D200-F200),NETWORKDAYS.INTL(C200,E200,1,JFERIES)-D200-F200))","v":0.5},"2013/02"]
["GUIOT Fabien","2013-02-10","2013-02-11",0,"2013-02-11",0,"RTT","Acceptée",{"$f":"IF(OR(G201=\"Convention\",H201=\"Refusée\"),0,IF(H201=\"Annulée\",-(NETWORKDAYS.INTL(C201,E201,1,JFERIES)-D201-F201),NETWORKDAYS.INTL(C201,E201,1,JFERIES)-D201-F201))","v":1},"2013/02"]
["RUBIO Isabel","2013-02-10","2013-02-13",0,"2013-02-13",0.5,"RTT","Acceptée",{"$f":"IF(OR(G202=\"Convention\",H202=\"Refusée\"),0,IF(H202=\"Annulée\",-(NETWORKDAYS.INTL(C202,E202,1,JFERIES)-D202-F202),NETWORKDAYS.INTL(C202,E202,1,JFERIES)-D202-F202))","v":0.5},"2013/02"]
["GUINOT Nathalie","2013-02-18","2013-02-18",0,"2013-02-18",0.5,"RTT","Acceptée",{"$f":"IF(OR(G203=\"Convention\",H203=\"Refusée\"),0,IF(H203=\"Annulée\",-(NETWORKDAYS.INTL(C203,E203,1,JFERIES)-D203-F203),NETWORKDAYS.INTL(C203,E203,1,JFERIES)-D203-F203))","v":0.5},"2013/02"]
["SIODMAK Eric","2013-02-22","2013-02-22",0,"2013-02-22",0,"RTT","Acceptée",{"$f":"IF(OR(G204=\"Convention\",H204=\"Refusée\"),0,IF(H204=\"Annulée\",-(NETWORKDAYS.INTL(C204,E204,1,JFERIES)-D204-F204),NETWORKDAYS.INTL(C204,E204,1,JFERIES)-D204-F204))","v":1},"2013/02"]
["HAUTEBRANC Alexis","2013-02-21","2013-02-21",0,"2013-02-21",0,"RTT","Acceptée",{"$f":"IF(OR(G205=\"Convention\",H205=\"Refusée\"),0,IF(H205=\"Annulée\",-(NETWORKDAYS.INTL(C205,E205,1,JFERIES)-D205-F205),NETWORKDAYS.INTL(C205,E205,1,JFERIES)-D205-F205))","v":1},"2013/02"]
["POMMERELL Patrick","2013-03-06","2013-03-06",0,"2013-03-06",0,"RTT","Acceptée",{"$f":"IF(OR(G206=\"Convention\",H206=\"Refusée\"),0,IF(H206=\"Annulée\",-(NETWORKDAYS.INTL(C206,E206,1,JFERIES)-D206-F206),NETWORKDAYS.INTL(C206,E206,1,JFERIES)-D206-F206))","v":1},"2013/03"]
["LOCATELLI Bruno","2013-03-12","2013-03-12",0,"2013-03-12",0.5,"RTT","Acceptée",{"$f":"IF(OR(G207=\"Convention\",H207=\"Refusée\"),0,IF(H207=\"Annulée\",-(NETWORKDAYS.INTL(C207,E207,1,JFERIES)-D207-F207),NETWORKDAYS.INTL(C207,E207,1,JFERIES)-D207-F207))","v":0.5},"2013/03"]
["LEDANT Charles","2013-03-18","2013-03-18",0,"2013-03-18",0,"RTT","Acceptée",{"$f":"IF(OR(G208=\"Convention\",H208=\"Refusée\"),0,IF(H208=\"Annulée\",-(NETWORKDAYS.INTL(C208,E208,1,JFERIES)-D208-F208),NETWORKDAYS.INTL(C208,E208,1,JFERIES)-D208-F208))","v":1},"2013/03"]
["PONS Olivier","2013-03-25","2013-03-25",0,"2013-03-25",0,"RTT","Acceptée",{"$f":"IF(OR(G209=\"Convention\",H209=\"Refusée\"),0,IF(H209=\"Annulée\",-(NETWORKDAYS.INTL(C209,E209,1,JFERIES)-D209-F209),NETWORKDAYS.INTL(C209,E209,1,JFERIES)-D209-F209))","v":1},"2013/03"]
["BEARZATTO Giovanni","2013-03-29","2013-03-29",0,"2013-03-29",0,"RTT","Acceptée",{"$f":"IF(OR(G210=\"Convention\",H210=\"Refusée\"),0,IF(H210=\"Annulée\",-(NETWORKDAYS.INTL(C210,E210,1,JFERIES)-D210-F210),NETWORKDAYS.INTL(C210,E210,1,JFERIES)-D210-F210))","v":1},"2013/03"]
["PONS Olivier","2013-04-02","2013-04-02",0,"2013-04-02",0,"RTT","Acceptée",{"$f":"IF(OR(G211=\"Convention\",H211=\"Refusée\"),0,IF(H211=\"Annulée\",-(NETWORKDAYS.INTL(C211,E211,1,JFERIES)-D211-F211),NETWORKDAYS.INTL(C211,E211,1,JFERIES)-D211-F211))","v":1},"2013/04"]
["HAUTEBRANC Alexis","2013-04-05","2013-04-05",0,"2013-04-05",0,"RTT","Acceptée",{"$f":"IF(OR(G212=\"Convention\",H212=\"Refusée\"),0,IF(H212=\"Annulée\",-(NETWORKDAYS.INTL(C212,E212,1,JFERIES)-D212-F212),NETWORKDAYS.INTL(C212,E212,1,JFERIES)-D212-F212))","v":1},"2013/04"]
["DREZET Olivier","2013-04-12","2013-04-12",0,"2013-04-12",0,"RTT","Acceptée",{"$f":"IF(OR(G213=\"Convention\",H213=\"Refusée\"),0,IF(H213=\"Annulée\",-(NETWORKDAYS.INTL(C213,E213,1,JFERIES)-D213-F213),NETWORKDAYS.INTL(C213,E213,1,JFERIES)-D213-F213))","v":1},"2013/04"]
["DEREPPE Bruno","2013-04-10","2013-04-10",0,"2013-04-10",0,"RTT","Acceptée",{"$f":"IF(OR(G214=\"Convention\",H214=\"Refusée\"),0,IF(H214=\"Annulée\",-(NETWORKDAYS.INTL(C214,E214,1,JFERIES)-D214-F214),NETWORKDAYS.INTL(C214,E214,1,JFERIES)-D214-F214))","v":1},"2013/04"]
["LOYER Michel","2013-04-17","2013-04-17",0,"2013-04-17",0,"RTT","Acceptée",{"$f":"IF(OR(G215=\"Convention\",H215=\"Refusée\"),0,IF(H215=\"Annulée\",-(NETWORKDAYS.INTL(C215,E215,1,JFERIES)-D215-F215),NETWORKDAYS.INTL(C215,E215,1,JFERIES)-D215-F215))","v":1},"2013/04"]
["HAUTCLOCQ Claude","2013-04-26","2013-04-26",0,"2013-04-26",0,"RTT","Acceptée",{"$f":"IF(OR(G216=\"Convention\",H216=\"Refusée\"),0,IF(H216=\"Annulée\",-(NETWORKDAYS.INTL(C216,E216,1,JFERIES)-D216-F216),NETWORKDAYS.INTL(C216,E216,1,JFERIES)-D216-F216))","v":1},"2013/04"]
["LEDANT Charles","2013-04-26","2013-04-26",0,"2013-04-26",0,"RTT","Acceptée",{"$f":"IF(OR(G217=\"Convention\",H217=\"Refusée\"),0,IF(H217=\"Annulée\",-(NETWORKDAYS.INTL(C217,E217,1,JFERIES)-D217-F217),NETWORKDAYS.INTL(C217,E217,1,JFERIES)-D217-F217))","v":1},"2013/04"]
["KADEM Christophe","2013-05-02","2013-05-02",0,"2013-05-02",0,"RTT","Acceptée",{"$f":"IF(OR(G218=\"Convention\",H218=\"Refusée\"),0,IF(H218=\"Annulée\",-(NETWORKDAYS.INTL(C218,E218,1,JFERIES)-D218-F218),NETWORKDAYS.INTL(C218,E218,1,JFERIES)-D218-F218))","v":1},"2013/05"]
["LAZZARO Fabien","2013-05-02","2013-05-02",0,"2013-05-02",0,"RTT","Acceptée",{"$f":"IF(OR(G219=\"Convention\",H219=\"Refusée\"),0,IF(H219=\"Annulée\",-(NETWORKDAYS.INTL(C219,E219,1,JFERIES)-D219-F219),NETWORKDAYS.INTL(C219,E219,1,JFERIES)-D219-F219))","v":1},"2013/05"]
["LIOGIER Serge","2013-05-07","2013-05-07",0,"2013-05-07",0,"RTT","Acceptée",{"$f":"IF(OR(G220=\"Convention\",H220=\"Refusée\"),0,IF(H220=\"Annulée\",-(NETWORKDAYS.INTL(C220,E220,1,JFERIES)-D220-F220),NETWORKDAYS.INTL(C220,E220,1,JFERIES)-D220-F220))","v":1},"2013/05"]
["GIRAUDON Alain","2013-05-06","2013-05-06",0,"2013-05-06",0,"RTT","Acceptée",{"$f":"IF(OR(G221=\"Convention\",H221=\"Refusée\"),0,IF(H221=\"Annulée\",-(NETWORKDAYS.INTL(C221,E221,1,JFERIES)-D221-F221),NETWORKDAYS.INTL(C221,E221,1,JFERIES)-D221-F221))","v":1},"2013/05"]
["LEDANT Charles","2013-05-17","2013-05-17",0,"2013-05-17",0,"RTT","Acceptée",{"$f":"IF(OR(G222=\"Convention\",H222=\"Refusée\"),0,IF(H222=\"Annulée\",-(NETWORKDAYS.INTL(C222,E222,1,JFERIES)-D222-F222),NETWORKDAYS.INTL(C222,E222,1,JFERIES)-D222-F222))","v":1},"2013/05"]
["RUBIO Isabel","2013-05-24","2013-05-24",0,"2013-05-24",0,"RTT","Acceptée",{"$f":"IF(OR(G223=\"Convention\",H223=\"Refusée\"),0,IF(H223=\"Annulée\",-(NETWORKDAYS.INTL(C223,E223,1,JFERIES)-D223-F223),NETWORKDAYS.INTL(C223,E223,1,JFERIES)-D223-F223))","v":1},"2013/05"]
["SIODMAK Eric","2013-05-28","2013-05-28",0,"2013-05-28",0,"RTT","Acceptée",{"$f":"IF(OR(G224=\"Convention\",H224=\"Refusée\"),0,IF(H224=\"Annulée\",-(NETWORKDAYS.INTL(C224,E224,1,JFERIES)-D224-F224),NETWORKDAYS.INTL(C224,E224,1,JFERIES)-D224-F224))","v":1},"2013/05"]
["LIOGIER Serge","2013-10-02","2013-10-31",0,"2013-10-31",0,"RTT","Acceptée",{"$f":"IF(OR(G225=\"Convention\",H225=\"Refusée\"),0,IF(H225=\"Annulée\",-(NETWORKDAYS.INTL(C225,E225,1,JFERIES)-D225-F225),NETWORKDAYS.INTL(C225,E225,1,JFERIES)-D225-F225))","v":1},"2013/10"]
["DREVON Alain","2013-10-02","2013-10-31",0,"2013-10-31",0,"RTT","Acceptée",{"$f":"IF(OR(G226=\"Convention\",H226=\"Refusée\"),0,IF(H226=\"Annulée\",-(NETWORKDAYS.INTL(C226,E226,1,JFERIES)-D226-F226),NETWORKDAYS.INTL(C226,E226,1,JFERIES)-D226-F226))","v":1},"2013/10"]
["LEDANT Charles","2013-10-02","2013-10-31",0,"2013-10-31",0,"RTT","Acceptée",{"$f":"IF(OR(G227=\"Convention\",H227=\"Refusée\"),0,IF(H227=\"Annulée\",-(NETWORKDAYS.INTL(C227,E227,1,JFERIES)-D227-F227),NETWORKDAYS.INTL(C227,E227,1,JFERIES)-D227-F227))","v":1},"2013/10"]
["DREZET Olivier","2013-10-30","2013-10-31",0,"2013-10-31",0,"RTT","Acceptée",{"$f":"IF(OR(G228=\"Convention\",H228=\"Refusée\"),0,IF(H228=\"Annulée\",-(NETWORKDAYS.INTL(C228,E228,1,JFERIES)-D228-F228),NETWORKDAYS.INTL(C228,E228,1,JFERIES)-D228-F228))","v":1},"2013/10"]
["POMMERELL Patrick","2013-11-13","2013-11-15",0.5,"2013-11-15",0,"CP","Acceptée",{"$f":"IF(OR(G229=\"Convention\",H229=\"Refusée\"),0,IF(H229=\"Annulée\",-(NETWORKDAYS.INTL(C229,E229,1,JFERIES)-D229-F229),NETWORKDAYS.INTL(C229,E229,1,JFERIES)-D229-F229))","v":0.5},"2013/11"]
["COUTANT Jean Paul","2013-11-13","2013-11-13",0,"2013-11-13",0,"RTT","Acceptée",{"$f":"IF(OR(G230=\"Convention\",H230=\"Refusée\"),0,IF(H230=\"Annulée\",-(NETWORKDAYS.INTL(C230,E230,1,JFERIES)-D230-F230),NETWORKDAYS.INTL(C230,E230,1,JFERIES)-D230-F230))","v":1},"2013/11"]
["SANTUCCI Lionel","2013-11-25","2013-11-27",0,"2013-11-27",0,"RTT","Acceptée",{"$f":"IF(OR(G231=\"Convention\",H231=\"Refusée\"),0,IF(H231=\"Annulée\",-(NETWORKDAYS.INTL(C231,E231,1,JFERIES)-D231-F231),NETWORKDAYS.INTL(C231,E231,1,JFERIES)-D231-F231))","v":1},"2013/11"]
["VAUTRAIN Franck","2013-11-25","2013-11-26",0,"2013-11-26",0,"RTT","Acceptée",{"$f":"IF(OR(G232=\"Convention\",H232=\"Refusée\"),0,IF(H232=\"Annulée\",-(NETWORKDAYS.INTL(C232,E232,1,JFERIES)-D232-F232),NETWORKDAYS.INTL(C232,E232,1,JFERIES)-D232-F232))","v":1},"2013/11"]
["LOCATELLI Bruno","2013-11-05","2013-11-28",0,"2013-11-28",0,"RTT","Acceptée",{"$f":"IF(OR(G233=\"Convention\",H233=\"Refusée\"),0,IF(H233=\"Annulée\",-(NETWORKDAYS.INTL(C233,E233,1,JFERIES)-D233-F233),NETWORKDAYS.INTL(C233,E233,1,JFERIES)-D233-F233))","v":1},"2013/11"]
["LEDANT Charles","2013-11-13","2013-11-29",0,"2013-11-29",0,"RTT","Acceptée",{"$f":"IF(OR(G234=\"Convention\",H234=\"Refusée\"),0,IF(H234=\"Annulée\",-(NETWORKDAYS.INTL(C234,E234,1,JFERIES)-D234-F234),NETWORKDAYS.INTL(C234,E234,1,JFERIES)-D234-F234))","v":1},"2013/11"]
["POMMERELL Patrick","2013-11-27","2013-11-27",0,"2013-11-27",0.5,"RTT","Acceptée",{"$f":"IF(OR(G235=\"Convention\",H235=\"Refusée\"),0,IF(H235=\"Annulée\",-(NETWORKDAYS.INTL(C235,E235,1,JFERIES)-D235-F235),NETWORKDAYS.INTL(C235,E235,1,JFERIES)-D235-F235))","v":0.5},"2013/11"]
["HEMLER Christelle","2013-11-27","2013-12-09",0,"2013-12-09",0,"RTT","Acceptée",{"$f":"IF(OR(G236=\"Convention\",H236=\"Refusée\"),0,IF(H236=\"Annulée\",-(NETWORKDAYS.INTL(C236,E236,1,JFERIES)-D236-F236),NETWORKDAYS.INTL(C236,E236,1,JFERIES)-D236-F236))","v":1},"2013/12"]
["HEMLER Christelle","2013-11-27","2013-12-11",0,"2013-12-11",0,"RTT","Acceptée",{"$f":"IF(OR(G237=\"Convention\",H237=\"Refusée\"),0,IF(H237=\"Annulée\",-(NETWORKDAYS.INTL(C237,E237,1,JFERIES)-D237-F237),NETWORKDAYS.INTL(C237,E237,1,JFERIES)-D237-F237))","v":1},"2013/12"]
["HEMLER Christelle","2013-11-27","2013-12-16",0,"2013-12-16",0,"RTT","Acceptée",{"$f":"IF(OR(G238=\"Convention\",H238=\"Refusée\"),0,IF(H238=\"Annulée\",-(NETWORKDAYS.INTL(C238,E238,1,JFERIES)-D238-F238),NETWORKDAYS.INTL(C238,E238,1,JFERIES)-D238-F238))","v":1},"2013/12"]
["HEMLER Christelle","2013-11-27","2013-12-23",0,"2013-12-23",0,"RTT","Acceptée",{"$f":"IF(OR(G239=\"Convention\",H239=\"Refusée\"),0,IF(H239=\"Annulée\",-(NETWORKDAYS.INTL(C239,E239,1,JFERIES)-D239-F239),NETWORKDAYS.INTL(C239,E239,1,JFERIES)-D239-F239))","v":1},"2013/12"]
["HEMLER Christelle","2013-11-27","2014-01-06",0,"2014-01-06",0,"RTT","Acceptée",{"$f":"IF(OR(G240=\"Convention\",H240=\"Refusée\"),0,IF(H240=\"Annulée\",-(NETWORKDAYS.INTL(C240,E240,1,JFERIES)-D240-F240),NETWORKDAYS.INTL(C240,E240,1,JFERIES)-D240-F240))","v":1},"2014/01","solde 2013"]
["HAUTCLOCQ Claude","2013-11-29","2013-12-31",0,"2013-12-31",0,"RTT","Acceptée",{"$f":"IF(OR(G241=\"Convention\",H241=\"Refusée\"),0,IF(H241=\"Annulée\",-(NETWORKDAYS.INTL(C241,E241,1,JFERIES)-D241-F241),NETWORKDAYS.INTL(C241,E241,1,JFERIES)-D241-F241))","v":1},"2013/12"]
["HAUTCLOCQ Claude","2013-11-04","2013-12-24",0,"2013-12-27",0,"CP","Acceptée",{"$f":"IF(OR(G242=\"Convention\",H242=\"Refusée\"),0,IF(H242=\"Annulée\",-(NETWORKDAYS.INTL(C242,E242,1,JFERIES)-D242-F242),NETWORKDAYS.INTL(C242,E242,1,JFERIES)-D242-F242))","v":3},"2013/12"]
["GUERIN Viviane","2013-11-27","2013-12-24",0,"2013-12-26",0,"RTT","Acceptée",{"$f":"IF(OR(G243=\"Convention\",H243=\"Refusée\"),0,IF(H243=\"Annulée\",-(NETWORKDAYS.INTL(C243,E243,1,JFERIES)-D243-F243),NETWORKDAYS.INTL(C243,E243,1,JFERIES)-D243-F243))","v":2},"2013/12"]
["LOCATELLI Bruno","2013-10-21","2013-12-24",0,"2013-12-26",0,"RTT","Acceptée",{"$f":"IF(OR(G244=\"Convention\",H244=\"Refusée\"),0,IF(H244=\"Annulée\",-(NETWORKDAYS.INTL(C244,E244,1,JFERIES)-D244-F244),NETWORKDAYS.INTL(C244,E244,1,JFERIES)-D244-F244))","v":2},"2013/12"]
["LOCATELLI Bruno","2013-12-12","2013-12-12",0,"2013-12-12",0.5,"CP","Acceptée",{"$f":"IF(OR(G245=\"Convention\",H245=\"Refusée\"),0,IF(H245=\"Annulée\",-(NETWORKDAYS.INTL(C245,E245,1,JFERIES)-D245-F245),NETWORKDAYS.INTL(C245,E245,1,JFERIES)-D245-F245))","v":0.5},"2013/12"]
["PLONQUET Christian","2013-11-18","2013-12-24",0,"2013-12-24",0,null,"Acceptée",{"$f":"IF(OR(G246=\"Convention\",H246=\"Refusée\"),0,IF(H246=\"Annulée\",-(NETWORKDAYS.INTL(C246,E246,1,JFERIES)-D246-F246),NETWORKDAYS.INTL(C246,E246,1,JFERIES)-D246-F246))","v":1},"2013/12","a recuperer"]
["MARAIS Bernard","2013-11-14","2013-12-26",0,"2013-12-27",0,"CP","Acceptée",{"$f":"IF(OR(G247=\"Convention\",H247=\"Refusée\"),0,IF(H247=\"Annulée\",-(NETWORKDAYS.INTL(C247,E247,1,JFERIES)-D247-F247),NETWORKDAYS.INTL(C247,E247,1,JFERIES)-D247-F247))","v":2},"2013/12"]
["HAUTEBRANC Alexis","2013-10-14","2013-12-26",0,"2013-12-26",0,"RTT","Acceptée",{"$f":"IF(OR(G248=\"Convention\",H248=\"Refusée\"),0,IF(H248=\"Annulée\",-(NETWORKDAYS.INTL(C248,E248,1,JFERIES)-D248-F248),NETWORKDAYS.INTL(C248,E248,1,JFERIES)-D248-F248))","v":1},"2013/12"]
["HAUTEBRANC Alexis","2013-11-08","2013-11-08",0,"2013-11-08",0,"RTT","Acceptée",{"$f":"IF(OR(G249=\"Convention\",H249=\"Refusée\"),0,IF(H249=\"Annulée\",-(NETWORKDAYS.INTL(C249,E249,1,JFERIES)-D249-F249),NETWORKDAYS.INTL(C249,E249,1,JFERIES)-D249-F249))","v":1},"2013/11"]
["HAUTEBRANC Alexis","2013-11-08","2013-11-15",0,"2013-11-15",0,"RTT","Acceptée",{"$f":"IF(OR(G250=\"Convention\",H250=\"Refusée\"),0,IF(H250=\"Annulée\",-(NETWORKDAYS.INTL(C250,E250,1,JFERIES)-D250-F250),NETWORKDAYS.INTL(C250,E250,1,JFERIES)-D250-F250))","v":1},"2013/11"]
["HAUTEBRANC Alexis","2013-10-14","2013-12-27",0,"2013-12-27",0,"RTT","Acceptée",{"$f":"IF(OR(G251=\"Convention\",H251=\"Refusée\"),0,IF(H251=\"Annulée\",-(NETWORKDAYS.INTL(C251,E251,1,JFERIES)-D251-F251),NETWORKDAYS.INTL(C251,E251,1,JFERIES)-D251-F251))","v":1},"2013/12"]
["SANTUCCI Lionel","2013-11-08","2013-12-31",0,"2013-12-31",0,"RTT","Acceptée",{"$f":"IF(OR(G252=\"Convention\",H252=\"Refusée\"),0,IF(H252=\"Annulée\",-(NETWORKDAYS.INTL(C252,E252,1,JFERIES)-D252-F252),NETWORKDAYS.INTL(C252,E252,1,JFERIES)-D252-F252))","v":1},"2013/12"]
["SANTUCCI Lionel","2013-11-08","2014-01-02",0,"2014-01-03",0,"RTT","Acceptée",{"$f":"IF(OR(G253=\"Convention\",H253=\"Refusée\"),0,IF(H253=\"Annulée\",-(NETWORKDAYS.INTL(C253,E253,1,JFERIES)-D253-F253),NETWORKDAYS.INTL(C253,E253,1,JFERIES)-D253-F253))","v":2},"2014/01"]
["LEDANT Charles","2013-10-15","2013-12-24",0,"2013-12-24",0,"RTT","Acceptée",{"$f":"IF(OR(G254=\"Convention\",H254=\"Refusée\"),0,IF(H254=\"Annulée\",-(NETWORKDAYS.INTL(C254,E254,1,JFERIES)-D254-F254),NETWORKDAYS.INTL(C254,E254,1,JFERIES)-D254-F254))","v":1},"2013/12"]
["LEDANT Charles","2013-10-15","2013-12-27",0,"2013-12-27",0,"RTT","Acceptée",{"$f":"IF(OR(G255=\"Convention\",H255=\"Refusée\"),0,IF(H255=\"Annulée\",-(NETWORKDAYS.INTL(C255,E255,1,JFERIES)-D255-F255),NETWORKDAYS.INTL(C255,E255,1,JFERIES)-D255-F255))","v":1},"2013/12"]
["LEDANT Charles","2013-10-15","2013-12-31",0,"2013-12-31",0,"CP","Acceptée",{"$f":"IF(OR(G256=\"Convention\",H256=\"Refusée\"),0,IF(H256=\"Annulée\",-(NETWORKDAYS.INTL(C256,E256,1,JFERIES)-D256-F256),NETWORKDAYS.INTL(C256,E256,1,JFERIES)-D256-F256))","v":1},"2013/12"]
["LEDANT Charles","2013-10-15","2014-01-02",0,"2014-01-02",0,"CP","Acceptée",{"$f":"IF(OR(G257=\"Convention\",H257=\"Refusée\"),0,IF(H257=\"Annulée\",-(NETWORKDAYS.INTL(C257,E257,1,JFERIES)-D257-F257),NETWORKDAYS.INTL(C257,E257,1,JFERIES)-D257-F257))","v":1},"2014/01"]
["MINAKIAN Mathilde","2013-11-27","2013-12-26",0,"2013-12-27",0,"CP","Acceptée",{"$f":"IF(OR(G258=\"Convention\",H258=\"Refusée\"),0,IF(H258=\"Annulée\",-(NETWORKDAYS.INTL(C258,E258,1,JFERIES)-D258-F258),NETWORKDAYS.INTL(C258,E258,1,JFERIES)-D258-F258))","v":2},"2013/12"]
["DREVON Alain","2013-10-25","2014-01-02",0,"2014-01-03",0,"RTT","Acceptée",{"$f":"IF(OR(G259=\"Convention\",H259=\"Refusée\"),0,IF(H259=\"Annulée\",-(NETWORKDAYS.INTL(C259,E259,1,JFERIES)-D259-F259),NETWORKDAYS.INTL(C259,E259,1,JFERIES)-D259-F259))","v":2},"2014/01"]
["LAZZARO Fabien","2013-09-18","2013-12-24",0,"2013-12-27",0,"RTT","Acceptée",{"$f":"IF(OR(G260=\"Convention\",H260=\"Refusée\"),0,IF(H260=\"Annulée\",-(NETWORKDAYS.INTL(C260,E260,1,JFERIES)-D260-F260),NETWORKDAYS.INTL(C260,E260,1,JFERIES)-D260-F260))","v":3},"2013/12"]
["PONS Olivier","2013-11-27","2013-12-26",0,"2013-12-27",0,"RTT","Acceptée",{"$f":"IF(OR(G261=\"Convention\",H261=\"Refusée\"),0,IF(H261=\"Annulée\",-(NETWORKDAYS.INTL(C261,E261,1,JFERIES)-D261-F261),NETWORKDAYS.INTL(C261,E261,1,JFERIES)-D261-F261))","v":2},"2013/12"]
["DREZET Olivier","2013-11-26","2014-01-02",0,"2014-01-02",0,"RTT","Acceptée",{"$f":"IF(OR(G262=\"Convention\",H262=\"Refusée\"),0,IF(H262=\"Annulée\",-(NETWORKDAYS.INTL(C262,E262,1,JFERIES)-D262-F262),NETWORKDAYS.INTL(C262,E262,1,JFERIES)-D262-F262))","v":1},"2014/01"]
["DREZET Olivier","2013-11-26","2013-12-23",0,"2013-12-24",0,"RTT","Acceptée",{"$f":"IF(OR(G263=\"Convention\",H263=\"Refusée\"),0,IF(H263=\"Annulée\",-(NETWORKDAYS.INTL(C263,E263,1,JFERIES)-D263-F263),NETWORKDAYS.INTL(C263,E263,1,JFERIES)-D263-F263))","v":2},"2013/12"]
["ROBIN Kevin","2013-11-29","2014-01-02",0,"2014-01-02",0,"CP","Acceptée",{"$f":"IF(OR(G264=\"Convention\",H264=\"Refusée\"),0,IF(H264=\"Annulée\",-(NETWORKDAYS.INTL(C264,E264,1,JFERIES)-D264-F264),NETWORKDAYS.INTL(C264,E264,1,JFERIES)-D264-F264))","v":1},"2014/01","le 3 est en réciup"]
["GIRAUDON Alain","2013-11-19","2013-12-26",0,"2013-12-27",0,"RTT","Acceptée",{"$f":"IF(OR(G265=\"Convention\",H265=\"Refusée\"),0,IF(H265=\"Annulée\",-(NETWORKDAYS.INTL(C265,E265,1,JFERIES)-D265-F265),NETWORKDAYS.INTL(C265,E265,1,JFERIES)-D265-F265))","v":2},"2013/12"]
["GUINOT Nathalie","2013-11-14","2014-01-02",0,"2014-01-03",0,"RTT","Acceptée",{"$f":"IF(OR(G266=\"Convention\",H266=\"Refusée\"),0,IF(H266=\"Annulée\",-(NETWORKDAYS.INTL(C266,E266,1,JFERIES)-D266-F266),NETWORKDAYS.INTL(C266,E266,1,JFERIES)-D266-F266))","v":2},"2014/01"]
["KADEM Christophe","2013-11-12","2013-12-26",0,"2013-12-26",0,"RTT","Acceptée",{"$f":"IF(OR(G267=\"Convention\",H267=\"Refusée\"),0,IF(H267=\"Annulée\",-(NETWORKDAYS.INTL(C267,E267,1,JFERIES)-D267-F267),NETWORKDAYS.INTL(C267,E267,1,JFERIES)-D267-F267))","v":1},"2013/12"]
["KADEM Christophe","2013-11-12","2013-12-31",0,"2013-12-31",0,"RTT","Acceptée",{"$f":"IF(OR(G268=\"Convention\",H268=\"Refusée\"),0,IF(H268=\"Annulée\",-(NETWORKDAYS.INTL(C268,E268,1,JFERIES)-D268-F268),NETWORKDAYS.INTL(C268,E268,1,JFERIES)-D268-F268))","v":1},"2013/12"]
["SOUCHET Alain","2013-10-31","2013-12-30",0,"2013-12-31",0,"RTT","Acceptée",{"$f":"IF(OR(G269=\"Convention\",H269=\"Refusée\"),0,IF(H269=\"Annulée\",-(NETWORKDAYS.INTL(C269,E269,1,JFERIES)-D269-F269),NETWORKDAYS.INTL(C269,E269,1,JFERIES)-D269-F269))","v":2},"2013/12"]
["TAQUET Alain","2013-10-15","2013-12-30",0,"2013-12-31",0,"RTT","Acceptée",{"$f":"IF(OR(G270=\"Convention\",H270=\"Refusée\"),0,IF(H270=\"Annulée\",-(NETWORKDAYS.INTL(C270,E270,1,JFERIES)-D270-F270),NETWORKDAYS.INTL(C270,E270,1,JFERIES)-D270-F270))","v":2},"2013/12"]
["DEREPPE Bruno","2013-11-29","2013-12-24",0,"2013-12-27",0,"RTT","Acceptée",{"$f":"IF(OR(G271=\"Convention\",H271=\"Refusée\"),0,IF(H271=\"Annulée\",-(NETWORKDAYS.INTL(C271,E271,1,JFERIES)-D271-F271),NETWORKDAYS.INTL(C271,E271,1,JFERIES)-D271-F271))","v":3},"2013/12","Accord spécifique"]
["BEARZATTO Giovanni","2013-11-29","2013-12-31",0,"2013-12-31",0,"RTT","Acceptée",{"$f":"IF(OR(G272=\"Convention\",H272=\"Refusée\"),0,IF(H272=\"Annulée\",-(NETWORKDAYS.INTL(C272,E272,1,JFERIES)-D272-F272),NETWORKDAYS.INTL(C272,E272,1,JFERIES)-D272-F272))","v":1},"2013/12"]
["BEARZATTO Giovanni","2013-11-29","2014-01-02",0,"2014-01-02",0,"RTT","Acceptée",{"$f":"IF(OR(G273=\"Convention\",H273=\"Refusée\"),0,IF(H273=\"Annulée\",-(NETWORKDAYS.INTL(C273,E273,1,JFERIES)-D273-F273),NETWORKDAYS.INTL(C273,E273,1,JFERIES)-D273-F273))","v":1},"2014/01"]
["POMMERELL Patrick","2013-11-29","2013-12-23",0,"2013-12-24",0,"RTT","Acceptée",{"$f":"IF(OR(G274=\"Convention\",H274=\"Refusée\"),0,IF(H274=\"Annulée\",-(NETWORKDAYS.INTL(C274,E274,1,JFERIES)-D274-F274),NETWORKDAYS.INTL(C274,E274,1,JFERIES)-D274-F274))","v":2},"2013/12"]
["CHEVALIER Yohan","2013-11-08","2013-12-26",0,"2013-12-27",0,"CP","Acceptée",{"$f":"IF(OR(G275=\"Convention\",H275=\"Refusée\"),0,IF(H275=\"Annulée\",-(NETWORKDAYS.INTL(C275,E275,1,JFERIES)-D275-F275),NETWORKDAYS.INTL(C275,E275,1,JFERIES)-D275-F275))","v":2},"2013/12"]
["SIODMAK Eric","2013-12-02","2014-01-02",0,"2014-01-03",0,"RTT","Acceptée",{"$f":"IF(OR(G276=\"Convention\",H276=\"Refusée\"),0,IF(H276=\"Annulée\",-(NETWORKDAYS.INTL(C276,E276,1,JFERIES)-D276-F276),NETWORKDAYS.INTL(C276,E276,1,JFERIES)-D276-F276))","v":2},"2014/01"]
["COUTANT Jean Paul","2013-12-04","2013-12-31",0,"2013-12-31",0,"RTT","Acceptée",{"$f":"IF(OR(G277=\"Convention\",H277=\"Refusée\"),0,IF(H277=\"Annulée\",-(NETWORKDAYS.INTL(C277,E277,1,JFERIES)-D277-F277),NETWORKDAYS.INTL(C277,E277,1,JFERIES)-D277-F277))","v":1},"2013/12"]
["COUTANT Jean Paul","2013-12-04","2013-12-05",0,"2013-12-05",0.5,"RTT","Acceptée",{"$f":"IF(OR(G278=\"Convention\",H278=\"Refusée\"),0,IF(H278=\"Annulée\",-(NETWORKDAYS.INTL(C278,E278,1,JFERIES)-D278-F278),NETWORKDAYS.INTL(C278,E278,1,JFERIES)-D278-F278))","v":0.5},"2013/12"]
["GIRAUDON Alain","2013-11-19","2014-04-07",0,"2014-04-11",0,"CP","Acceptée",{"$f":"IF(OR(G279=\"Convention\",H279=\"Refusée\"),0,IF(H279=\"Annulée\",-(NETWORKDAYS.INTL(C279,E279,1,JFERIES)-D279-F279),NETWORKDAYS.INTL(C279,E279,1,JFERIES)-D279-F279))","v":5},"2014/04"]
["GIRAUDON Alain","2013-11-19","2014-04-14",0,"2014-04-14",0,"RTT","Acceptée",{"$f":"IF(OR(G280=\"Convention\",H280=\"Refusée\"),0,IF(H280=\"Annulée\",-(NETWORKDAYS.INTL(C280,E280,1,JFERIES)-D280-F280),NETWORKDAYS.INTL(C280,E280,1,JFERIES)-D280-F280))","v":1},"2014/04"]
["LOYER Michel","2013-12-06","2013-12-26",0,"2013-12-27",0,"RTT","Acceptée",{"$f":"IF(OR(G281=\"Convention\",H281=\"Refusée\"),0,IF(H281=\"Annulée\",-(NETWORKDAYS.INTL(C281,E281,1,JFERIES)-D281-F281),NETWORKDAYS.INTL(C281,E281,1,JFERIES)-D281-F281))","v":2},"2013/12"]
["GUIOT Fabien","2013-12-11","2014-01-02",0,"2014-01-03",0,"RTT","Acceptée",{"$f":"IF(OR(G282=\"Convention\",H282=\"Refusée\"),0,IF(H282=\"Annulée\",-(NETWORKDAYS.INTL(C282,E282,1,JFERIES)-D282-F282),NETWORKDAYS.INTL(C282,E282,1,JFERIES)-D282-F282))","v":2},"2014/01"]
["HAUTCLOCQ Claude","2013-12-06","2014-01-02",0,"2014-01-03",0,"CP","Acceptée",{"$f":"IF(OR(G283=\"Convention\",H283=\"Refusée\"),0,IF(H283=\"Annulée\",-(NETWORKDAYS.INTL(C283,E283,1,JFERIES)-D283-F283),NETWORKDAYS.INTL(C283,E283,1,JFERIES)-D283-F283))","v":2},"2014/01"]
["MARZOUK Sami","2013-12-13","2013-12-23",0,"2013-12-24",0,"RTT","Acceptée",{"$f":"IF(OR(G284=\"Convention\",H284=\"Refusée\"),0,IF(H284=\"Annulée\",-(NETWORKDAYS.INTL(C284,E284,1,JFERIES)-D284-F284),NETWORKDAYS.INTL(C284,E284,1,JFERIES)-D284-F284))","v":2},"2013/12"]
["VAUTRAIN Franck","2013-12-18","2014-01-09",0,"2014-01-09",0,"CP","Acceptée",{"$f":"IF(OR(G285=\"Convention\",H285=\"Refusée\"),0,IF(H285=\"Annulée\",-(NETWORKDAYS.INTL(C285,E285,1,JFERIES)-D285-F285),NETWORKDAYS.INTL(C285,E285,1,JFERIES)-D285-F285))","v":1},"2014/01"]
["VAUTRAIN Franck","2013-12-23","2013-12-30",0,"2013-12-31",0,"RTT","Acceptée",{"$f":"IF(OR(G286=\"Convention\",H286=\"Refusée\"),0,IF(H286=\"Annulée\",-(NETWORKDAYS.INTL(C286,E286,1,JFERIES)-D286-F286),NETWORKDAYS.INTL(C286,E286,1,JFERIES)-D286-F286))","v":2},"2013/12"]
["VAUTRAIN Franck","2013-12-23","2014-01-01",0,"2014-01-02",0,"RTT","Acceptée",{"$f":"IF(OR(G287=\"Convention\",H287=\"Refusée\"),0,IF(H287=\"Annulée\",-(NETWORKDAYS.INTL(C287,E287,1,JFERIES)-D287-F287),NETWORKDAYS.INTL(C287,E287,1,JFERIES)-D287-F287))","v":1},"2014/01"]
["GIRAUDON Alain","2013-12-28","2014-01-02",0,"2014-01-02",0,"RTT","Acceptée",{"$f":"IF(OR(G288=\"Convention\",H288=\"Refusée\"),0,IF(H288=\"Annulée\",-(NETWORKDAYS.INTL(C288,E288,1,JFERIES)-D288-F288),NETWORKDAYS.INTL(C288,E288,1,JFERIES)-D288-F288))","v":1},"2014/01"]
["POMMERELL Patrick","2013-12-23","2013-12-23",0,"2013-12-24",0,"CP","Acceptée",{"$f":"IF(OR(G289=\"Convention\",H289=\"Refusée\"),0,IF(H289=\"Annulée\",-(NETWORKDAYS.INTL(C289,E289,1,JFERIES)-D289-F289),NETWORKDAYS.INTL(C289,E289,1,JFERIES)-D289-F289))","v":2},"2013/12"]
["GUERIN Viviane","2013-06-25","2013-06-27",0,"2013-06-27",0.5,"RTD Recup","Acceptée",{"$f":"IF(OR(G290=\"Convention\",H290=\"Refusée\"),0,IF(H290=\"Annulée\",-(NETWORKDAYS.INTL(C290,E290,1,JFERIES)-D290-F290),NETWORKDAYS.INTL(C290,E290,1,JFERIES)-D290-F290))","v":0.5},"2013/06"]
["HAUTCLOCQ Claude","2014-01-06","2014-01-10",0,"2014-01-10",0,"CP","Acceptée",{"$f":"IF(OR(G291=\"Convention\",H291=\"Refusée\"),0,IF(H291=\"Annulée\",-(NETWORKDAYS.INTL(C291,E291,1,JFERIES)-D291-F291),NETWORKDAYS.INTL(C291,E291,1,JFERIES)-D291-F291))","v":1},"2014/01"]
["PONS Olivier","2014-01-07","2014-01-31",0,"2014-01-31",0,"RTT","Acceptée",{"$f":"IF(OR(G292=\"Convention\",H292=\"Refusée\"),0,IF(H292=\"Annulée\",-(NETWORKDAYS.INTL(C292,E292,1,JFERIES)-D292-F292),NETWORKDAYS.INTL(C292,E292,1,JFERIES)-D292-F292))","v":1},"2014/01"]
["LOCATELLI Bruno","2014-01-13","2014-01-15",0.5,"2014-01-15",0,"CP","Acceptée",{"$f":"IF(OR(G293=\"Convention\",H293=\"Refusée\"),0,IF(H293=\"Annulée\",-(NETWORKDAYS.INTL(C293,E293,1,JFERIES)-D293-F293),NETWORKDAYS.INTL(C293,E293,1,JFERIES)-D293-F293))","v":0.5},"2014/01"]
["LOCATELLI Bruno","2014-01-09","2014-01-17",0,"2014-01-17",0,"CP","Acceptée",{"$f":"IF(OR(G294=\"Convention\",H294=\"Refusée\"),0,IF(H294=\"Annulée\",-(NETWORKDAYS.INTL(C294,E294,1,JFERIES)-D294-F294),NETWORKDAYS.INTL(C294,E294,1,JFERIES)-D294-F294))","v":1},"2014/01"]
["DREVON Alain","2014-01-09","2014-01-17",0,"2014-01-17",0.5,"RTT","Acceptée",{"$f":"IF(OR(G295=\"Convention\",H295=\"Refusée\"),0,IF(H295=\"Annulée\",-(NETWORKDAYS.INTL(C295,E295,1,JFERIES)-D295-F295),NETWORKDAYS.INTL(C295,E295,1,JFERIES)-D295-F295))","v":0.5},"2014/01"]
["DREVON Alain","2014-01-09","2014-02-20",0,"2014-02-21",0,"CP","Acceptée",{"$f":"IF(OR(G296=\"Convention\",H296=\"Refusée\"),0,IF(H296=\"Annulée\",-(NETWORKDAYS.INTL(C296,E296,1,JFERIES)-D296-F296),NETWORKDAYS.INTL(C296,E296,1,JFERIES)-D296-F296))","v":2},"2014/02"]
["DREVON Alain","2014-01-09","2014-03-03",0,"2014-03-07",0,"CP","Acceptée",{"$f":"IF(OR(G297=\"Convention\",H297=\"Refusée\"),0,IF(H297=\"Annulée\",-(NETWORKDAYS.INTL(C297,E297,1,JFERIES)-D297-F297),NETWORKDAYS.INTL(C297,E297,1,JFERIES)-D297-F297))","v":5},"2014/03"]
["DREVON Alain","2014-01-09","2014-05-05",0,"2014-05-07",0,"CP","Acceptée",{"$f":"IF(OR(G298=\"Convention\",H298=\"Refusée\"),0,IF(H298=\"Annulée\",-(NETWORKDAYS.INTL(C298,E298,1,JFERIES)-D298-F298),NETWORKDAYS.INTL(C298,E298,1,JFERIES)-D298-F298))","v":3},"2014/05"]
["LEDANT Charles","2014-01-13","2014-04-28",0,"2014-04-30",0,"CP","Acceptée",{"$f":"IF(OR(G299=\"Convention\",H299=\"Refusée\"),0,IF(H299=\"Annulée\",-(NETWORKDAYS.INTL(C299,E299,1,JFERIES)-D299-F299),NETWORKDAYS.INTL(C299,E299,1,JFERIES)-D299-F299))","v":3},"2014/04"]
["LEDANT Charles","2014-01-13","2014-05-01",0,"2014-05-02",0,"CP","Acceptée",{"$f":"IF(OR(G300=\"Convention\",H300=\"Refusée\"),0,IF(H300=\"Annulée\",-(NETWORKDAYS.INTL(C300,E300,1,JFERIES)-D300-F300),NETWORKDAYS.INTL(C300,E300,1,JFERIES)-D300-F300))","v":1},"2014/05"]
["HAUTEBRANC Alexis","2014-01-06","2014-05-27",0,"2014-05-30",0,"CP","Acceptée",{"$f":"IF(OR(G301=\"Convention\",H301=\"Refusée\"),0,IF(H301=\"Annulée\",-(NETWORKDAYS.INTL(C301,E301,1,JFERIES)-D301-F301),NETWORKDAYS.INTL(C301,E301,1,JFERIES)-D301-F301))","v":3},"2014/05","regroupement de 2 demandes"]
["BERTHE Magali","2014-01-09","2014-04-28",0,"2014-04-30",0,"CP","Acceptée",{"$f":"IF(OR(G302=\"Convention\",H302=\"Refusée\"),0,IF(H302=\"Annulée\",-(NETWORKDAYS.INTL(C302,E302,1,JFERIES)-D302-F302),NETWORKDAYS.INTL(C302,E302,1,JFERIES)-D302-F302))","v":3},"2014/04","acceptées à l'embauche"]
["BERTHE Magali","2014-01-09","2014-05-01",0,"2014-05-09",0,"CP","Acceptée",{"$f":"IF(OR(G303=\"Convention\",H303=\"Refusée\"),0,IF(H303=\"Annulée\",-(NETWORKDAYS.INTL(C303,E303,1,JFERIES)-D303-F303),NETWORKDAYS.INTL(C303,E303,1,JFERIES)-D303-F303))","v":5},"2014/05","acceptées à l'embauche"]
["LOCATELLI Bruno","2013-10-21","2014-03-17",0,"2014-03-21",0,"CP","Acceptée",{"$f":"IF(OR(G304=\"Convention\",H304=\"Refusée\"),0,IF(H304=\"Annulée\",-(NETWORKDAYS.INTL(C304,E304,1,JFERIES)-D304-F304),NETWORKDAYS.INTL(C304,E304,1,JFERIES)-D304-F304))","v":5},"2014/03"]
["LAZZARO Fabien","2014-01-06","2014-04-22",0,"2014-04-25",0,"CP","Acceptée",{"$f":"IF(OR(G305=\"Convention\",H305=\"Refusée\"),0,IF(H305=\"Annulée\",-(NETWORKDAYS.INTL(C305,E305,1,JFERIES)-D305-F305),NETWORKDAYS.INTL(C305,E305,1,JFERIES)-D305-F305))","v":4},"2014/04"]
["LAZZARO Fabien","2014-01-06","2014-04-28",0,"2014-04-30",0,"Convention","Acceptée",{"$f":"IF(OR(G306=\"Convention\",H306=\"Refusée\"),0,IF(H306=\"Annulée\",-(NETWORKDAYS.INTL(C306,E306,1,JFERIES)-D306-F306),NETWORKDAYS.INTL(C306,E306,1,JFERIES)-D306-F306))","v":0},"2014/04","MARIAGE (3j)"]
["LAZZARO Fabien","2014-01-06","2014-05-01",0,"2014-05-02",0,"Convention","Acceptée",{"$f":"IF(OR(G307=\"Convention\",H307=\"Refusée\"),0,IF(H307=\"Annulée\",-(NETWORKDAYS.INTL(C307,E307,1,JFERIES)-D307-F307),NETWORKDAYS.INTL(C307,E307,1,JFERIES)-D307-F307))","v":0},"2014/05","MARIAGE (1j)"]
["LAZZARO Fabien","2014-01-06","2014-05-05",0,"2014-05-09",0,"CP","Acceptée",{"$f":"IF(OR(G308=\"Convention\",H308=\"Refusée\"),0,IF(H308=\"Annulée\",-(NETWORKDAYS.INTL(C308,E308,1,JFERIES)-D308-F308),NETWORKDAYS.INTL(C308,E308,1,JFERIES)-D308-F308))","v":4},"2014/05"]
["COUTANT Jean Paul","2014-01-24","2014-02-26",0,"2014-02-28",0,"CP","Acceptée",{"$f":"IF(OR(G309=\"Convention\",H309=\"Refusée\"),0,IF(H309=\"Annulée\",-(NETWORKDAYS.INTL(C309,E309,1,JFERIES)-D309-F309),NETWORKDAYS.INTL(C309,E309,1,JFERIES)-D309-F309))","v":3},"2014/02"]
["GUERIN Viviane","2014-01-23","2014-02-07",0,"2014-02-07",0,"RTT","Acceptée",{"$f":"IF(OR(G310=\"Convention\",H310=\"Refusée\"),0,IF(H310=\"Annulée\",-(NETWORKDAYS.INTL(C310,E310,1,JFERIES)-D310-F310),NETWORKDAYS.INTL(C310,E310,1,JFERIES)-D310-F310))","v":1},"2014/02","Solde 2013"]
["GUERIN Viviane","2014-01-23","2014-03-10",0,"2014-03-10",0,"RTD Recup","Acceptée",{"$f":"IF(OR(G311=\"Convention\",H311=\"Refusée\"),0,IF(H311=\"Annulée\",-(NETWORKDAYS.INTL(C311,E311,1,JFERIES)-D311-F311),NETWORKDAYS.INTL(C311,E311,1,JFERIES)-D311-F311))","v":1},"2014/03","artd 2013"]
["GUERIN Viviane","2014-01-23","2014-02-28",0,"2014-02-28",0,"RTD Recup","Acceptée",{"$f":"IF(OR(G312=\"Convention\",H312=\"Refusée\"),0,IF(H312=\"Annulée\",-(NETWORKDAYS.INTL(C312,E312,1,JFERIES)-D312-F312),NETWORKDAYS.INTL(C312,E312,1,JFERIES)-D312-F312))","v":1},"2014/02","artd 2013"]
["TAQUET Alain","2014-02-07","2014-03-03",0,"2014-03-04",0,"RTT","Acceptée",{"$f":"IF(OR(G313=\"Convention\",H313=\"Refusée\"),0,IF(H313=\"Annulée\",-(NETWORKDAYS.INTL(C313,E313,1,JFERIES)-D313-F313),NETWORKDAYS.INTL(C313,E313,1,JFERIES)-D313-F313))","v":2},"2014/03","solde 2013"]
["HAUTEBRANC Alexis","2014-02-04","2014-05-26",0,"2014-05-26",0,"CP","Acceptée",{"$f":"IF(OR(G314=\"Convention\",H314=\"Refusée\"),0,IF(H314=\"Annulée\",-(NETWORKDAYS.INTL(C314,E314,1,JFERIES)-D314-F314),NETWORKDAYS.INTL(C314,E314,1,JFERIES)-D314-F314))","v":1},"2014/05"]
["GUERIN Viviane","2014-02-03","2014-04-04",0,"2014-04-07",0,"RTD Recup","Acceptée",{"$f":"IF(OR(G315=\"Convention\",H315=\"Refusée\"),0,IF(H315=\"Annulée\",-(NETWORKDAYS.INTL(C315,E315,1,JFERIES)-D315-F315),NETWORKDAYS.INTL(C315,E315,1,JFERIES)-D315-F315))","v":2},"2014/04","artd 2013"]
["GUERIN Viviane","2014-02-03","2014-05-05",0,"2014-05-07",0,"CP","Acceptée",{"$f":"IF(OR(G316=\"Convention\",H316=\"Refusée\"),0,IF(H316=\"Annulée\",-(NETWORKDAYS.INTL(C316,E316,1,JFERIES)-D316-F316),NETWORKDAYS.INTL(C316,E316,1,JFERIES)-D316-F316))","v":3},"2014/05"]
["HAUTEBRANC Alexis","2014-01-13","2014-02-21",0,"2014-02-21",0,"RTT","Acceptée",{"$f":"IF(OR(G317=\"Convention\",H317=\"Refusée\"),0,IF(H317=\"Annulée\",-(NETWORKDAYS.INTL(C317,E317,1,JFERIES)-D317-F317),NETWORKDAYS.INTL(C317,E317,1,JFERIES)-D317-F317))","v":1},"2014/02"]
["GUERIN Viviane","2014-02-03","2014-05-02",0,"2014-05-02",0,"CP","Acceptée",{"$f":"IF(OR(G318=\"Convention\",H318=\"Refusée\"),0,IF(H318=\"Annulée\",-(NETWORKDAYS.INTL(C318,E318,1,JFERIES)-D318-F318),NETWORKDAYS.INTL(C318,E318,1,JFERIES)-D318-F318))","v":1},"2014/05"]
["GUIOT Fabien","2014-02-11","2014-02-21",0,"2014-02-21",0,"RTT","Acceptée",{"$f":"IF(OR(G319=\"Convention\",H319=\"Refusée\"),0,IF(H319=\"Annulée\",-(NETWORKDAYS.INTL(C319,E319,1,JFERIES)-D319-F319),NETWORKDAYS.INTL(C319,E319,1,JFERIES)-D319-F319))","v":1},"2014/02"]
["GUIOT Fabien","2014-02-12","2014-02-24",0,"2014-02-25",0,"CP","Acceptée",{"$f":"IF(OR(G320=\"Convention\",H320=\"Refusée\"),0,IF(H320=\"Annulée\",-(NETWORKDAYS.INTL(C320,E320,1,JFERIES)-D320-F320),NETWORKDAYS.INTL(C320,E320,1,JFERIES)-D320-F320))","v":2},"2014/02"]
["GUIOT Fabien","2014-02-12","2014-04-14",0,"2014-04-18",0,"CP","Acceptée",{"$f":"IF(OR(G321=\"Convention\",H321=\"Refusée\"),0,IF(H321=\"Annulée\",-(NETWORKDAYS.INTL(C321,E321,1,JFERIES)-D321-F321),NETWORKDAYS.INTL(C321,E321,1,JFERIES)-D321-F321))","v":5},"2014/04"]
["LOYER Michel","2014-02-17","2014-02-26",0,"2014-02-28",0,"CP","Acceptée",{"$f":"IF(OR(G322=\"Convention\",H322=\"Refusée\"),0,IF(H322=\"Annulée\",-(NETWORKDAYS.INTL(C322,E322,1,JFERIES)-D322-F322),NETWORKDAYS.INTL(C322,E322,1,JFERIES)-D322-F322))","v":3},"2014/02"]
["DEREPPE Bruno","2014-02-17","2014-02-25",0,"2014-02-25",0,"RTT","Acceptée",{"$f":"IF(OR(G323=\"Convention\",H323=\"Refusée\"),0,IF(H323=\"Annulée\",-(NETWORKDAYS.INTL(C323,E323,1,JFERIES)-D323-F323),NETWORKDAYS.INTL(C323,E323,1,JFERIES)-D323-F323))","v":1},"2014/02"]
["POMMERELL Patrick","2014-02-19","2014-02-21",0,"2014-02-21",0.5,"RTT","Acceptée",{"$f":"IF(OR(G324=\"Convention\",H324=\"Refusée\"),0,IF(H324=\"Annulée\",-(NETWORKDAYS.INTL(C324,E324,1,JFERIES)-D324-F324),NETWORKDAYS.INTL(C324,E324,1,JFERIES)-D324-F324))","v":0.5},"2014/02"]
["SIODMAK Eric","2014-02-20","2014-04-22",0,"2014-04-25",0,"CP","Acceptée",{"$f":"IF(OR(G325=\"Convention\",H325=\"Refusée\"),0,IF(H325=\"Annulée\",-(NETWORKDAYS.INTL(C325,E325,1,JFERIES)-D325-F325),NETWORKDAYS.INTL(C325,E325,1,JFERIES)-D325-F325))","v":4},"2014/04"]
["SIODMAK Eric","2014-02-20","2014-02-24",0.5,"2014-02-24",0,"RTT","Acceptée",{"$f":"IF(OR(G326=\"Convention\",H326=\"Refusée\"),0,IF(H326=\"Annulée\",-(NETWORKDAYS.INTL(C326,E326,1,JFERIES)-D326-F326),NETWORKDAYS.INTL(C326,E326,1,JFERIES)-D326-F326))","v":0.5},"2014/02"]
["SIODMAK Eric","2014-02-20","2014-03-03",0,"2014-03-07",0,"CP","Acceptée",{"$f":"IF(OR(G327=\"Convention\",H327=\"Refusée\"),0,IF(H327=\"Annulée\",-(NETWORKDAYS.INTL(C327,E327,1,JFERIES)-D327-F327),NETWORKDAYS.INTL(C327,E327,1,JFERIES)-D327-F327))","v":5},"2014/03"]
["KADEM Christophe","2014-02-17","2014-03-10",0,"2014-03-14",0,"CP","Acceptée",{"$f":"IF(OR(G328=\"Convention\",H328=\"Refusée\"),0,IF(H328=\"Annulée\",-(NETWORKDAYS.INTL(C328,E328,1,JFERIES)-D328-F328),NETWORKDAYS.INTL(C328,E328,1,JFERIES)-D328-F328))","v":5},"2014/03"]
["KADEM Christophe","2014-02-27","2014-04-22",0,"2014-04-25",0,"CP","Acceptée",{"$f":"IF(OR(G329=\"Convention\",H329=\"Refusée\"),0,IF(H329=\"Annulée\",-(NETWORKDAYS.INTL(C329,E329,1,JFERIES)-D329-F329),NETWORKDAYS.INTL(C329,E329,1,JFERIES)-D329-F329))","v":4},"2014/04"]
["BETRY Aymeric","2014-02-21","2014-02-21",0,"2014-02-21",0,"CP","Acceptée",{"$f":"IF(OR(G330=\"Convention\",H330=\"Refusée\"),0,IF(H330=\"Annulée\",-(NETWORKDAYS.INTL(C330,E330,1,JFERIES)-D330-F330),NETWORKDAYS.INTL(C330,E330,1,JFERIES)-D330-F330))","v":1},"2014/02","accord par anticipation - malade"]
["BEARZATTO Giovanni","2014-01-24","2014-02-03",0,"2014-02-07",0,"CP","Acceptée",{"$f":"IF(OR(G331=\"Convention\",H331=\"Refusée\"),0,IF(H331=\"Annulée\",-(NETWORKDAYS.INTL(C331,E331,1,JFERIES)-D331-F331),NETWORKDAYS.INTL(C331,E331,1,JFERIES)-D331-F331))","v":5},"2014/02"]
["LEDANT Charles","2014-02-14","2014-02-28",0,"2014-02-28",0,"CP","Acceptée",{"$f":"IF(OR(G332=\"Convention\",H332=\"Refusée\"),0,IF(H332=\"Annulée\",-(NETWORKDAYS.INTL(C332,E332,1,JFERIES)-D332-F332),NETWORKDAYS.INTL(C332,E332,1,JFERIES)-D332-F332))","v":1},"2014/02"]
["LEDANT Charles","2014-02-14","2014-03-24",0,"2014-03-24",0,"CP","Acceptée",{"$f":"IF(OR(G333=\"Convention\",H333=\"Refusée\"),0,IF(H333=\"Annulée\",-(NETWORKDAYS.INTL(C333,E333,1,JFERIES)-D333-F333),NETWORKDAYS.INTL(C333,E333,1,JFERIES)-D333-F333))","v":1},"2014/03"]
["LEDANT Charles","2014-02-14","2014-04-18",0,"2014-04-18",0,"CP","Acceptée",{"$f":"IF(OR(G334=\"Convention\",H334=\"Refusée\"),0,IF(H334=\"Annulée\",-(NETWORKDAYS.INTL(C334,E334,1,JFERIES)-D334-F334),NETWORKDAYS.INTL(C334,E334,1,JFERIES)-D334-F334))","v":1},"2014/04"]
["LEDANT Charles","2014-02-14","2014-05-09",0,"2014-05-09",0,"CP","Acceptée",{"$f":"IF(OR(G335=\"Convention\",H335=\"Refusée\"),0,IF(H335=\"Annulée\",-(NETWORKDAYS.INTL(C335,E335,1,JFERIES)-D335-F335),NETWORKDAYS.INTL(C335,E335,1,JFERIES)-D335-F335))","v":1},"2014/05"]
["GIRAUDON Alain","2014-02-18","2014-02-18",0,"2014-02-18",0.5,"RTT","Acceptée",{"$f":"IF(OR(G336=\"Convention\",H336=\"Refusée\"),0,IF(H336=\"Annulée\",-(NETWORKDAYS.INTL(C336,E336,1,JFERIES)-D336-F336),NETWORKDAYS.INTL(C336,E336,1,JFERIES)-D336-F336))","v":0.5},"2014/02"]
["TAQUET Alain","2014-02-21","2014-03-05",0,"2014-03-06",0,"CP","Acceptée",{"$f":"IF(OR(G337=\"Convention\",H337=\"Refusée\"),0,IF(H337=\"Annulée\",-(NETWORKDAYS.INTL(C337,E337,1,JFERIES)-D337-F337),NETWORKDAYS.INTL(C337,E337,1,JFERIES)-D337-F337))","v":2},"2014/03"]
["TAQUET Alain","2014-02-21","2014-04-28",0,"2014-04-30",0,"CP","Acceptée",{"$f":"IF(OR(G338=\"Convention\",H338=\"Refusée\"),0,IF(H338=\"Annulée\",-(NETWORKDAYS.INTL(C338,E338,1,JFERIES)-D338-F338),NETWORKDAYS.INTL(C338,E338,1,JFERIES)-D338-F338))","v":3},"2014/04"]
["TAQUET Alain","2014-02-21","2014-03-07",0,"2014-03-07",0,"RTD Recup","Acceptée",{"$f":"IF(OR(G339=\"Convention\",H339=\"Refusée\"),0,IF(H339=\"Annulée\",-(NETWORKDAYS.INTL(C339,E339,1,JFERIES)-D339-F339),NETWORKDAYS.INTL(C339,E339,1,JFERIES)-D339-F339))","v":1},"2014/03","ARTD 2013"]
["TAQUET Alain","2014-02-21","2014-05-02",0,"2014-05-02",0,"RTD Recup","Acceptée",{"$f":"IF(OR(G340=\"Convention\",H340=\"Refusée\"),0,IF(H340=\"Annulée\",-(NETWORKDAYS.INTL(C340,E340,1,JFERIES)-D340-F340),NETWORKDAYS.INTL(C340,E340,1,JFERIES)-D340-F340))","v":1},"2014/05","ARTD 2013"]
["LAZZARO Fabien","2014-02-20","2014-03-03",0,"2014-03-03",0,"RTT","Acceptée",{"$f":"IF(OR(G341=\"Convention\",H341=\"Refusée\"),0,IF(H341=\"Annulée\",-(NETWORKDAYS.INTL(C341,E341,1,JFERIES)-D341-F341),NETWORKDAYS.INTL(C341,E341,1,JFERIES)-D341-F341))","v":1},"2014/03"]
["DREZET Olivier","2014-03-03","2014-03-17",0,"2014-03-17",0,"RTT","Acceptée",{"$f":"IF(OR(G342=\"Convention\",H342=\"Refusée\"),0,IF(H342=\"Annulée\",-(NETWORKDAYS.INTL(C342,E342,1,JFERIES)-D342-F342),NETWORKDAYS.INTL(C342,E342,1,JFERIES)-D342-F342))","v":1},"2014/03"]
["HEMLER Christelle","2014-03-03","2014-03-06",0,"2014-03-06",0,"CP","Acceptée",{"$f":"IF(OR(G343=\"Convention\",H343=\"Refusée\"),0,IF(H343=\"Annulée\",-(NETWORKDAYS.INTL(C343,E343,1,JFERIES)-D343-F343),NETWORKDAYS.INTL(C343,E343,1,JFERIES)-D343-F343))","v":1},"2014/03"]
["HEMLER Christelle","2014-03-03","2014-03-19",0,"2014-03-19",0,"CP","Acceptée",{"$f":"IF(OR(G344=\"Convention\",H344=\"Refusée\"),0,IF(H344=\"Annulée\",-(NETWORKDAYS.INTL(C344,E344,1,JFERIES)-D344-F344),NETWORKDAYS.INTL(C344,E344,1,JFERIES)-D344-F344))","v":1},"2014/03"]
["LAZZARO Fabien","2014-02-26","2014-03-24",0,"2014-03-24",0,"RTD Recup","Acceptée",{"$f":"IF(OR(G345=\"Convention\",H345=\"Refusée\"),0,IF(H345=\"Annulée\",-(NETWORKDAYS.INTL(C345,E345,1,JFERIES)-D345-F345),NETWORKDAYS.INTL(C345,E345,1,JFERIES)-D345-F345))","v":1},"2014/03","ARTD 2013"]
["GUERIN Viviane","2014-03-03","2014-03-21",0,"2014-03-21",0.5,"RTD Recup","Acceptée",{"$f":"IF(OR(G346=\"Convention\",H346=\"Refusée\"),0,IF(H346=\"Annulée\",-(NETWORKDAYS.INTL(C346,E346,1,JFERIES)-D346-F346),NETWORKDAYS.INTL(C346,E346,1,JFERIES)-D346-F346))","v":0.5},"2014/03","artd 2013"]
["GUERIN Viviane","2014-03-03","2014-07-11",0,"2014-07-11",0.5,"RTD Recup","Acceptée",{"$f":"IF(OR(G347=\"Convention\",H347=\"Refusée\"),0,IF(H347=\"Annulée\",-(NETWORKDAYS.INTL(C347,E347,1,JFERIES)-D347-F347),NETWORKDAYS.INTL(C347,E347,1,JFERIES)-D347-F347))","v":0.5},"2014/07","artd 2013"]
["GUERIN Viviane","2014-03-03","2014-03-31",0,"2014-03-31",0,"CP","Acceptée",{"$f":"IF(OR(G348=\"Convention\",H348=\"Refusée\"),0,IF(H348=\"Annulée\",-(NETWORKDAYS.INTL(C348,E348,1,JFERIES)-D348-F348),NETWORKDAYS.INTL(C348,E348,1,JFERIES)-D348-F348))","v":1},"2014/03"]
["GUERIN Viviane","2014-03-03","2014-05-09",0,"2014-05-09",0,"RTT","Acceptée",{"$f":"IF(OR(G349=\"Convention\",H349=\"Refusée\"),0,IF(H349=\"Annulée\",-(NETWORKDAYS.INTL(C349,E349,1,JFERIES)-D349-F349),NETWORKDAYS.INTL(C349,E349,1,JFERIES)-D349-F349))","v":1},"2014/05"]
["LOCATELLI Bruno","2014-03-03","2014-04-07",0,"2014-04-07",0,"CP","Acceptée",{"$f":"IF(OR(G350=\"Convention\",H350=\"Refusée\"),0,IF(H350=\"Annulée\",-(NETWORKDAYS.INTL(C350,E350,1,JFERIES)-D350-F350),NETWORKDAYS.INTL(C350,E350,1,JFERIES)-D350-F350))","v":1},"2014/04"]
["SANTUCCI Lionel","2014-10-29","2013-10-29",0.5,"2013-10-31",0,"CP","Acceptée",{"$f":"IF(OR(G351=\"Convention\",H351=\"Refusée\"),0,IF(H351=\"Annulée\",-(NETWORKDAYS.INTL(C351,E351,1,JFERIES)-D351-F351),NETWORKDAYS.INTL(C351,E351,1,JFERIES)-D351-F351))","v":2.5},"2013/10"]
["SANTUCCI Lionel","2014-03-03","2014-03-07",0,"2014-03-07",0,"CP","Acceptée",{"$f":"IF(OR(G352=\"Convention\",H352=\"Refusée\"),0,IF(H352=\"Annulée\",-(NETWORKDAYS.INTL(C352,E352,1,JFERIES)-D352-F352),NETWORKDAYS.INTL(C352,E352,1,JFERIES)-D352-F352))","v":1},"2014/03"]
["MARAIS Bernard","2014-01-28","2014-05-30",0,"2014-05-30",0,"CP","Acceptée",{"$f":"IF(OR(G353=\"Convention\",H353=\"Refusée\"),0,IF(H353=\"Annulée\",-(NETWORKDAYS.INTL(C353,E353,1,JFERIES)-D353-F353),NETWORKDAYS.INTL(C353,E353,1,JFERIES)-D353-F353))","v":1},"2014/05"]
["LOCATELLI Bruno","2014-02-25","2014-03-14",0,"2014-03-14",0,"CP","Acceptée",{"$f":"IF(OR(G354=\"Convention\",H354=\"Refusée\"),0,IF(H354=\"Annulée\",-(NETWORKDAYS.INTL(C354,E354,1,JFERIES)-D354-F354),NETWORKDAYS.INTL(C354,E354,1,JFERIES)-D354-F354))","v":1},"2014/03"]
["MARAIS Bernard","2014-01-02","2014-05-02",0,"2014-05-09",0,"CP","Acceptée",{"$f":"IF(OR(G355=\"Convention\",H355=\"Refusée\"),0,IF(H355=\"Annulée\",-(NETWORKDAYS.INTL(C355,E355,1,JFERIES)-D355-F355),NETWORKDAYS.INTL(C355,E355,1,JFERIES)-D355-F355))","v":5},"2014/05"]
["MARAIS Bernard","2014-01-28","2014-05-30",0,"2014-05-30",0,"CP","Acceptée",{"$f":"IF(OR(G356=\"Convention\",H356=\"Refusée\"),0,IF(H356=\"Annulée\",-(NETWORKDAYS.INTL(C356,E356,1,JFERIES)-D356-F356),NETWORKDAYS.INTL(C356,E356,1,JFERIES)-D356-F356))","v":1},"2014/05"]
["LOYER Michel","2014-03-07","2014-04-28",0,"2014-05-02",0,"CP","Acceptée",{"$f":"IF(OR(G357=\"Convention\",H357=\"Refusée\"),0,IF(H357=\"Annulée\",-(NETWORKDAYS.INTL(C357,E357,1,JFERIES)-D357-F357),NETWORKDAYS.INTL(C357,E357,1,JFERIES)-D357-F357))","v":4},"2014/05"]
["GUERIN Viviane","2014-03-03","2014-05-30",0,"2014-05-30",0,"CP","Acceptée",{"$f":"IF(OR(G358=\"Convention\",H358=\"Refusée\"),0,IF(H358=\"Annulée\",-(NETWORKDAYS.INTL(C358,E358,1,JFERIES)-D358-F358),NETWORKDAYS.INTL(C358,E358,1,JFERIES)-D358-F358))","v":1},"2014/05"]
["BEARZATTO Giovanni","2014-03-14","2014-05-26",0,"2014-05-30",0,"CP","Acceptée",{"$f":"IF(OR(G359=\"Convention\",H359=\"Refusée\"),0,IF(H359=\"Annulée\",-(NETWORKDAYS.INTL(C359,E359,1,JFERIES)-D359-F359),NETWORKDAYS.INTL(C359,E359,1,JFERIES)-D359-F359))","v":4},"2014/05"]
["MARZOUK Sami","2014-03-14","2014-03-17",0,"2014-03-21",0,"CP","Acceptée",{"$f":"IF(OR(G360=\"Convention\",H360=\"Refusée\"),0,IF(H360=\"Annulée\",-(NETWORKDAYS.INTL(C360,E360,1,JFERIES)-D360-F360),NETWORKDAYS.INTL(C360,E360,1,JFERIES)-D360-F360))","v":5},"2014/03"]
["MARAIS Bernard","2014-03-17","2014-04-17",0,"2014-04-18",0,"CP","Acceptée",{"$f":"IF(OR(G361=\"Convention\",H361=\"Refusée\"),0,IF(H361=\"Annulée\",-(NETWORKDAYS.INTL(C361,E361,1,JFERIES)-D361-F361),NETWORKDAYS.INTL(C361,E361,1,JFERIES)-D361-F361))","v":2},"2014/04"]
["COUTANT Jean Paul","2014-03-18","2014-04-22",0,"2014-04-25",0,"CP","Acceptée",{"$f":"IF(OR(G362=\"Convention\",H362=\"Refusée\"),0,IF(H362=\"Annulée\",-(NETWORKDAYS.INTL(C362,E362,1,JFERIES)-D362-F362),NETWORKDAYS.INTL(C362,E362,1,JFERIES)-D362-F362))","v":4},"2014/04"]
["SOUCHET Alain","2014-03-18","2014-05-12",0,"2014-05-16",0,"CP","Acceptée",{"$f":"IF(OR(G363=\"Convention\",H363=\"Refusée\"),0,IF(H363=\"Annulée\",-(NETWORKDAYS.INTL(C363,E363,1,JFERIES)-D363-F363),NETWORKDAYS.INTL(C363,E363,1,JFERIES)-D363-F363))","v":5},"2014/05"]
["POMMERELL Patrick","2014-03-17","2014-03-18",0,"2014-03-18",0,"CP","Acceptée",{"$f":"IF(OR(G364=\"Convention\",H364=\"Refusée\"),0,IF(H364=\"Annulée\",-(NETWORKDAYS.INTL(C364,E364,1,JFERIES)-D364-F364),NETWORKDAYS.INTL(C364,E364,1,JFERIES)-D364-F364))","v":1},"2014/03"]
["POMMERELL Patrick","2014-03-17","2014-05-19",0,"2014-05-23",0,"CP","Acceptée",{"$f":"IF(OR(G365=\"Convention\",H365=\"Refusée\"),0,IF(H365=\"Annulée\",-(NETWORKDAYS.INTL(C365,E365,1,JFERIES)-D365-F365),NETWORKDAYS.INTL(C365,E365,1,JFERIES)-D365-F365))","v":5},"2014/05"]
["SOUCHET Alain","2014-03-19","2014-05-02",0,"2014-05-02",0,"CP","Acceptée",{"$f":"IF(OR(G366=\"Convention\",H366=\"Refusée\"),0,IF(H366=\"Annulée\",-(NETWORKDAYS.INTL(C366,E366,1,JFERIES)-D366-F366),NETWORKDAYS.INTL(C366,E366,1,JFERIES)-D366-F366))","v":1},"2014/05"]
["SOUCHET Alain","2014-03-19","2014-05-09",0,"2014-05-09",0,"CP","Acceptée",{"$f":"IF(OR(G367=\"Convention\",H367=\"Refusée\"),0,IF(H367=\"Annulée\",-(NETWORKDAYS.INTL(C367,E367,1,JFERIES)-D367-F367),NETWORKDAYS.INTL(C367,E367,1,JFERIES)-D367-F367))","v":1},"2014/05"]
["SOUCHET Alain","2014-03-19","2014-05-30",0,"2014-05-30",0,"CP","Acceptée",{"$f":"IF(OR(G368=\"Convention\",H368=\"Refusée\"),0,IF(H368=\"Annulée\",-(NETWORKDAYS.INTL(C368,E368,1,JFERIES)-D368-F368),NETWORKDAYS.INTL(C368,E368,1,JFERIES)-D368-F368))","v":1},"2014/05"]
["BEARZATTO Giovanni","2014-03-19","2014-04-04",0,"2014-04-04",0,"CP","Acceptée",{"$f":"IF(OR(G369=\"Convention\",H369=\"Refusée\"),0,IF(H369=\"Annulée\",-(NETWORKDAYS.INTL(C369,E369,1,JFERIES)-D369-F369),NETWORKDAYS.INTL(C369,E369,1,JFERIES)-D369-F369))","v":1},"2014/04"]
["POMMERELL Patrick","2014-03-24","2014-04-11",0,"2014-04-11",0,"CP","Acceptée",{"$f":"IF(OR(G370=\"Convention\",H370=\"Refusée\"),0,IF(H370=\"Annulée\",-(NETWORKDAYS.INTL(C370,E370,1,JFERIES)-D370-F370),NETWORKDAYS.INTL(C370,E370,1,JFERIES)-D370-F370))","v":1},"2014/04"]
["POMMERELL Patrick","2014-03-24","2014-04-22",0,"2014-04-25",0,"CP","Acceptée",{"$f":"IF(OR(G371=\"Convention\",H371=\"Refusée\"),0,IF(H371=\"Annulée\",-(NETWORKDAYS.INTL(C371,E371,1,JFERIES)-D371-F371),NETWORKDAYS.INTL(C371,E371,1,JFERIES)-D371-F371))","v":4},"2014/04"]
["GUIOT Fabien","2014-03-24","2014-03-27",0,"2014-03-27",0,"CP","Acceptée",{"$f":"IF(OR(G372=\"Convention\",H372=\"Refusée\"),0,IF(H372=\"Annulée\",-(NETWORKDAYS.INTL(C372,E372,1,JFERIES)-D372-F372),NETWORKDAYS.INTL(C372,E372,1,JFERIES)-D372-F372))","v":1},"2014/03"]
["HEMLER Christelle","2014-03-24","2014-03-26",0,"2014-03-26",0,"CP","Acceptée",{"$f":"IF(OR(G373=\"Convention\",H373=\"Refusée\"),0,IF(H373=\"Annulée\",-(NETWORKDAYS.INTL(C373,E373,1,JFERIES)-D373-F373),NETWORKDAYS.INTL(C373,E373,1,JFERIES)-D373-F373))","v":1},"2014/03"]
["PONS Olivier","2014-03-24","2014-04-03",0,"2014-04-04",0,"CP","Acceptée",{"$f":"IF(OR(G374=\"Convention\",H374=\"Refusée\"),0,IF(H374=\"Annulée\",-(NETWORKDAYS.INTL(C374,E374,1,JFERIES)-D374-F374),NETWORKDAYS.INTL(C374,E374,1,JFERIES)-D374-F374))","v":2},"2014/04"]
["GUERIN Viviane","2014-03-21","2014-04-30",0,"2014-04-30",0,"CP","Acceptée",{"$f":"IF(OR(G375=\"Convention\",H375=\"Refusée\"),0,IF(H375=\"Annulée\",-(NETWORKDAYS.INTL(C375,E375,1,JFERIES)-D375-F375),NETWORKDAYS.INTL(C375,E375,1,JFERIES)-D375-F375))","v":1},"2014/04"]
["LOYER Michel","2014-03-26","2014-03-31",0,"2014-03-31",0,"CP","Acceptée",{"$f":"IF(OR(G376=\"Convention\",H376=\"Refusée\"),0,IF(H376=\"Annulée\",-(NETWORKDAYS.INTL(C376,E376,1,JFERIES)-D376-F376),NETWORKDAYS.INTL(C376,E376,1,JFERIES)-D376-F376))","v":1},"2014/03"]
["GUINOT Nathalie","2014-03-31","2014-04-22",0,"2014-04-25",0,"CP","Acceptée",{"$f":"IF(OR(G377=\"Convention\",H377=\"Refusée\"),0,IF(H377=\"Annulée\",-(NETWORKDAYS.INTL(C377,E377,1,JFERIES)-D377-F377),NETWORKDAYS.INTL(C377,E377,1,JFERIES)-D377-F377))","v":4},"2014/04"]
["CHEVALIER Yohan","2014-03-28","2014-04-07",0,"2014-04-09",0,"CP","Acceptée",{"$f":"IF(OR(G378=\"Convention\",H378=\"Refusée\"),0,IF(H378=\"Annulée\",-(NETWORKDAYS.INTL(C378,E378,1,JFERIES)-D378-F378),NETWORKDAYS.INTL(C378,E378,1,JFERIES)-D378-F378))","v":3},"2014/04"]
["DEREPPE Bruno","2014-04-01","2014-04-14",0,"2014-04-18",0,"CP","Acceptée",{"$f":"IF(OR(G379=\"Convention\",H379=\"Refusée\"),0,IF(H379=\"Annulée\",-(NETWORKDAYS.INTL(C379,E379,1,JFERIES)-D379-F379),NETWORKDAYS.INTL(C379,E379,1,JFERIES)-D379-F379))","v":5},"2014/04"]
["TAQUET Alain","2014-03-28","2014-05-09",0,"2014-05-09",0,"CP","Acceptée",{"$f":"IF(OR(G380=\"Convention\",H380=\"Refusée\"),0,IF(H380=\"Annulée\",-(NETWORKDAYS.INTL(C380,E380,1,JFERIES)-D380-F380),NETWORKDAYS.INTL(C380,E380,1,JFERIES)-D380-F380))","v":1},"2014/05"]
["TAQUET Alain","2014-03-28","2014-05-26",0,"2014-05-30",0,"CP","Acceptée",{"$f":"IF(OR(G381=\"Convention\",H381=\"Refusée\"),0,IF(H381=\"Annulée\",-(NETWORKDAYS.INTL(C381,E381,1,JFERIES)-D381-F381),NETWORKDAYS.INTL(C381,E381,1,JFERIES)-D381-F381))","v":4},"2014/05"]
["VAUTRAIN Franck","2014-04-07","2014-04-11",0,"2014-04-11",0,"RTT","Acceptée",{"$f":"IF(OR(G382=\"Convention\",H382=\"Refusée\"),0,IF(H382=\"Annulée\",-(NETWORKDAYS.INTL(C382,E382,1,JFERIES)-D382-F382),NETWORKDAYS.INTL(C382,E382,1,JFERIES)-D382-F382))","v":1},"2014/04"]
["LOCATELLI Bruno","2014-03-31","2014-04-22",0,"2014-04-22",0,"RTT","Acceptée",{"$f":"IF(OR(G383=\"Convention\",H383=\"Refusée\"),0,IF(H383=\"Annulée\",-(NETWORKDAYS.INTL(C383,E383,1,JFERIES)-D383-F383),NETWORKDAYS.INTL(C383,E383,1,JFERIES)-D383-F383))","v":1},"2014/04"]
["LOCATELLI Bruno","2014-03-28","2014-05-02",0,"2014-05-02",0,"CP","Acceptée",{"$f":"IF(OR(G384=\"Convention\",H384=\"Refusée\"),0,IF(H384=\"Annulée\",-(NETWORKDAYS.INTL(C384,E384,1,JFERIES)-D384-F384),NETWORKDAYS.INTL(C384,E384,1,JFERIES)-D384-F384))","v":1},"2014/05","Accord congés antipés sur 2014/2015"]
["LOCATELLI Bruno","2014-03-28","2014-05-09",0,"2014-05-09",0,"CP","Acceptée",{"$f":"IF(OR(G385=\"Convention\",H385=\"Refusée\"),0,IF(H385=\"Annulée\",-(NETWORKDAYS.INTL(C385,E385,1,JFERIES)-D385-F385),NETWORKDAYS.INTL(C385,E385,1,JFERIES)-D385-F385))","v":1},"2014/05","Accord congés antipés sur 2014/2015"]
["LOCATELLI Bruno","2014-03-28","2014-05-26",0,"2014-05-26",0,"CP","Acceptée",{"$f":"IF(OR(G386=\"Convention\",H386=\"Refusée\"),0,IF(H386=\"Annulée\",-(NETWORKDAYS.INTL(C386,E386,1,JFERIES)-D386-F386),NETWORKDAYS.INTL(C386,E386,1,JFERIES)-D386-F386))","v":1},"2014/05","demande d'origine du 26 au 30/05. modif mail"]
["VAUTRAIN Franck","2014-03-27","2014-05-02",0,"2014-05-09",0,"CP","Acceptée",{"$f":"IF(OR(G387=\"Convention\",H387=\"Refusée\"),0,IF(H387=\"Annulée\",-(NETWORKDAYS.INTL(C387,E387,1,JFERIES)-D387-F387),NETWORKDAYS.INTL(C387,E387,1,JFERIES)-D387-F387))","v":5},"2014/05"]
["VAUTRAIN Franck","2014-03-27","2014-05-30",0,"2014-05-30",0,"CP","Acceptée",{"$f":"IF(OR(G388=\"Convention\",H388=\"Refusée\"),0,IF(H388=\"Annulée\",-(NETWORKDAYS.INTL(C388,E388,1,JFERIES)-D388-F388),NETWORKDAYS.INTL(C388,E388,1,JFERIES)-D388-F388))","v":1},"2014/05"]
["VAUTRAIN Franck","2014-03-27","2014-04-18",0,"2014-04-22",0,"CP","Acceptée",{"$f":"IF(OR(G389=\"Convention\",H389=\"Refusée\"),0,IF(H389=\"Annulée\",-(NETWORKDAYS.INTL(C389,E389,1,JFERIES)-D389-F389),NETWORKDAYS.INTL(C389,E389,1,JFERIES)-D389-F389))","v":2},"2014/04"]
["PONS Olivier","2014-04-02","2014-04-11",0,"2014-04-11",0,"CP","Acceptée",{"$f":"IF(OR(G390=\"Convention\",H390=\"Refusée\"),0,IF(H390=\"Annulée\",-(NETWORKDAYS.INTL(C390,E390,1,JFERIES)-D390-F390),NETWORKDAYS.INTL(C390,E390,1,JFERIES)-D390-F390))","v":1},"2014/04"]
["PLONQUET Christian","2014-04-07","2014-04-22",0,"2014-04-30",0,"Convention","Acceptée",{"$f":"IF(OR(G391=\"Convention\",H391=\"Refusée\"),0,IF(H391=\"Annulée\",-(NETWORKDAYS.INTL(C391,E391,1,JFERIES)-D391-F391),NETWORKDAYS.INTL(C391,E391,1,JFERIES)-D391-F391))","v":0},"2014/04","Recup 5j"]
["LOCATELLI Bruno","2014-03-28","2014-06-02",0,"2014-06-02",0,"RTT","Acceptée",{"$f":"IF(OR(G392=\"Convention\",H392=\"Refusée\"),0,IF(H392=\"Annulée\",-(NETWORKDAYS.INTL(C392,E392,1,JFERIES)-D392-F392),NETWORKDAYS.INTL(C392,E392,1,JFERIES)-D392-F392))","v":1},"2014/06"]
["VAUTRAIN Franck","2014-04-07","2014-04-11",0,"2014-04-11",0.5,"RTT","Acceptée",{"$f":"IF(OR(G393=\"Convention\",H393=\"Refusée\"),0,IF(H393=\"Annulée\",-(NETWORKDAYS.INTL(C393,E393,1,JFERIES)-D393-F393),NETWORKDAYS.INTL(C393,E393,1,JFERIES)-D393-F393))","v":0.5},"2014/04"]
["COUTANT Jean Paul","2013-12-31","2014-01-02",0,"2014-01-03",0,"CP","Acceptée",{"$f":"IF(OR(G394=\"Convention\",H394=\"Refusée\"),0,IF(H394=\"Annulée\",-(NETWORKDAYS.INTL(C394,E394,1,JFERIES)-D394-F394),NETWORKDAYS.INTL(C394,E394,1,JFERIES)-D394-F394))","v":2},"2014/01"]
["POMMERELL Patrick","2014-04-09","2014-04-09",0,"2014-04-09",0,"RTT","Acceptée",{"$f":"IF(OR(G395=\"Convention\",H395=\"Refusée\"),0,IF(H395=\"Annulée\",-(NETWORKDAYS.INTL(C395,E395,1,JFERIES)-D395-F395),NETWORKDAYS.INTL(C395,E395,1,JFERIES)-D395-F395))","v":1},"2014/04"]
["LOYER Michel","2014-04-11","2014-04-14",0,"2014-04-14",0,"CP","Acceptée",{"$f":"IF(OR(G396=\"Convention\",H396=\"Refusée\"),0,IF(H396=\"Annulée\",-(NETWORKDAYS.INTL(C396,E396,1,JFERIES)-D396-F396),NETWORKDAYS.INTL(C396,E396,1,JFERIES)-D396-F396))","v":1},"2014/04"]
["ROBIN Kevin","2014-04-11","2014-05-02",0,"2014-05-02",0,"CP","Acceptée",{"$f":"IF(OR(G397=\"Convention\",H397=\"Refusée\"),0,IF(H397=\"Annulée\",-(NETWORKDAYS.INTL(C397,E397,1,JFERIES)-D397-F397),NETWORKDAYS.INTL(C397,E397,1,JFERIES)-D397-F397))","v":1},"2014/05"]
["ROBIN Kevin","2014-04-11","2014-05-09",0,"2014-05-09",0,"CP","Acceptée",{"$f":"IF(OR(G398=\"Convention\",H398=\"Refusée\"),0,IF(H398=\"Annulée\",-(NETWORKDAYS.INTL(C398,E398,1,JFERIES)-D398-F398),NETWORKDAYS.INTL(C398,E398,1,JFERIES)-D398-F398))","v":1},"2014/05"]
["ROBIN Kevin","2014-04-11","2014-05-30",0,"2014-05-30",0,"CP","Acceptée",{"$f":"IF(OR(G399=\"Convention\",H399=\"Refusée\"),0,IF(H399=\"Annulée\",-(NETWORKDAYS.INTL(C399,E399,1,JFERIES)-D399-F399),NETWORKDAYS.INTL(C399,E399,1,JFERIES)-D399-F399))","v":1},"2014/05"]
["COUTANT Jean Paul","2014-04-14","2014-05-02",0,"2014-05-02",0,"CP","Acceptée",{"$f":"IF(OR(G400=\"Convention\",H400=\"Refusée\"),0,IF(H400=\"Annulée\",-(NETWORKDAYS.INTL(C400,E400,1,JFERIES)-D400-F400),NETWORKDAYS.INTL(C400,E400,1,JFERIES)-D400-F400))","v":1},"2014/05"]
["COUTANT Jean Paul","2014-04-14","2014-05-09",0,"2014-05-09",0,"CP","Acceptée",{"$f":"IF(OR(G401=\"Convention\",H401=\"Refusée\"),0,IF(H401=\"Annulée\",-(NETWORKDAYS.INTL(C401,E401,1,JFERIES)-D401-F401),NETWORKDAYS.INTL(C401,E401,1,JFERIES)-D401-F401))","v":1},"2014/05"]
["COUTANT Jean Paul","2014-04-14","2014-05-21",0,"2014-05-21",0,"CP","Acceptée",{"$f":"IF(OR(G402=\"Convention\",H402=\"Refusée\"),0,IF(H402=\"Annulée\",-(NETWORKDAYS.INTL(C402,E402,1,JFERIES)-D402-F402),NETWORKDAYS.INTL(C402,E402,1,JFERIES)-D402-F402))","v":1},"2014/05"]
["COUTANT Jean Paul","2014-04-14","2014-05-30",0,"2014-05-30",0,"CP","Acceptée",{"$f":"IF(OR(G403=\"Convention\",H403=\"Refusée\"),0,IF(H403=\"Annulée\",-(NETWORKDAYS.INTL(C403,E403,1,JFERIES)-D403-F403),NETWORKDAYS.INTL(C403,E403,1,JFERIES)-D403-F403))","v":1},"2014/05"]
["DREVON Alain","2014-01-09","2014-05-02",0,"2014-05-02",0,"RTT","Acceptée",{"$f":"IF(OR(G404=\"Convention\",H404=\"Refusée\"),0,IF(H404=\"Annulée\",-(NETWORKDAYS.INTL(C404,E404,1,JFERIES)-D404-F404),NETWORKDAYS.INTL(C404,E404,1,JFERIES)-D404-F404))","v":1},"2014/05"]
["DREVON Alain","2014-01-09","2014-05-09",0,"2014-05-09",0,"RTT","Acceptée",{"$f":"IF(OR(G405=\"Convention\",H405=\"Refusée\"),0,IF(H405=\"Annulée\",-(NETWORKDAYS.INTL(C405,E405,1,JFERIES)-D405-F405),NETWORKDAYS.INTL(C405,E405,1,JFERIES)-D405-F405))","v":1},"2014/05"]
["DREVON Alain","2014-01-09","2014-05-30",0,"2014-05-30",0,"RTT","Acceptée",{"$f":"IF(OR(G406=\"Convention\",H406=\"Refusée\"),0,IF(H406=\"Annulée\",-(NETWORKDAYS.INTL(C406,E406,1,JFERIES)-D406-F406),NETWORKDAYS.INTL(C406,E406,1,JFERIES)-D406-F406))","v":1},"2014/05"]
["LEDANT Charles","2014-02-07","2014-05-30",0,"2014-05-30",0,"RTT","Acceptée",{"$f":"IF(OR(G407=\"Convention\",H407=\"Refusée\"),0,IF(H407=\"Annulée\",-(NETWORKDAYS.INTL(C407,E407,1,JFERIES)-D407-F407),NETWORKDAYS.INTL(C407,E407,1,JFERIES)-D407-F407))","v":1},"2014/05"]
["SANTUCCI Lionel","2014-04-11","2014-05-05",0,"2014-05-09",0,"CP","Acceptée",{"$f":"IF(OR(G408=\"Convention\",H408=\"Refusée\"),0,IF(H408=\"Annulée\",-(NETWORKDAYS.INTL(C408,E408,1,JFERIES)-D408-F408),NETWORKDAYS.INTL(C408,E408,1,JFERIES)-D408-F408))","v":4},"2014/05"]
["BEARZATTO Giovanni","2014-04-14","2014-05-02",0,"2014-05-02",0,"CP","Acceptée",{"$f":"IF(OR(G409=\"Convention\",H409=\"Refusée\"),0,IF(H409=\"Annulée\",-(NETWORKDAYS.INTL(C409,E409,1,JFERIES)-D409-F409),NETWORKDAYS.INTL(C409,E409,1,JFERIES)-D409-F409))","v":1},"2014/05"]
["BEARZATTO Giovanni","2014-04-14","2014-05-09",0,"2014-05-09",0,"CP","Acceptée",{"$f":"IF(OR(G410=\"Convention\",H410=\"Refusée\"),0,IF(H410=\"Annulée\",-(NETWORKDAYS.INTL(C410,E410,1,JFERIES)-D410-F410),NETWORKDAYS.INTL(C410,E410,1,JFERIES)-D410-F410))","v":1},"2014/05"]
["LOCATELLI Bruno","2014-04-23","2014-05-30",0,"2014-05-30",0,"CP","Acceptée",{"$f":"IF(OR(G411=\"Convention\",H411=\"Refusée\"),0,IF(H411=\"Annulée\",-(NETWORKDAYS.INTL(C411,E411,1,JFERIES)-D411-F411),NETWORKDAYS.INTL(C411,E411,1,JFERIES)-D411-F411))","v":1},"2014/05","demande d'origine du 26 au 30/05. modif mail"]
["LOCATELLI Bruno","2014-04-23","2014-05-22",0,"2014-05-23",0,"CP","Acceptée",{"$f":"IF(OR(G412=\"Convention\",H412=\"Refusée\"),0,IF(H412=\"Annulée\",-(NETWORKDAYS.INTL(C412,E412,1,JFERIES)-D412-F412),NETWORKDAYS.INTL(C412,E412,1,JFERIES)-D412-F412))","v":2},"2014/05","demande d'origine du 26 au 30/05. modif mail"]
["PONS Olivier","2014-04-23","2014-04-30",0,"2014-04-30",0,"CP","Acceptée",{"$f":"IF(OR(G413=\"Convention\",H413=\"Refusée\"),0,IF(H413=\"Annulée\",-(NETWORKDAYS.INTL(C413,E413,1,JFERIES)-D413-F413),NETWORKDAYS.INTL(C413,E413,1,JFERIES)-D413-F413))","v":1},"2014/04","accord tel du 23/04/2014"]
["PONS Olivier","2014-04-23","2014-05-02",0,"2014-05-05",0,"CP","Acceptée",{"$f":"IF(OR(G414=\"Convention\",H414=\"Refusée\"),0,IF(H414=\"Annulée\",-(NETWORKDAYS.INTL(C414,E414,1,JFERIES)-D414-F414),NETWORKDAYS.INTL(C414,E414,1,JFERIES)-D414-F414))","v":2},"2014/05","accord tel du 23/04/2014"]
["PONS Olivier","2014-04-23","2014-05-09",0,"2014-05-09",0,"CP","Acceptée",{"$f":"IF(OR(G415=\"Convention\",H415=\"Refusée\"),0,IF(H415=\"Annulée\",-(NETWORKDAYS.INTL(C415,E415,1,JFERIES)-D415-F415),NETWORKDAYS.INTL(C415,E415,1,JFERIES)-D415-F415))","v":1},"2014/05","accord tel du 23/04/2014"]
["PONS Olivier","2014-04-23","2014-05-30",0,"2014-05-30",0,"CP","Acceptée",{"$f":"IF(OR(G416=\"Convention\",H416=\"Refusée\"),0,IF(H416=\"Annulée\",-(NETWORKDAYS.INTL(C416,E416,1,JFERIES)-D416-F416),NETWORKDAYS.INTL(C416,E416,1,JFERIES)-D416-F416))","v":1},"2014/05","accord tel du 23/04/2014"]
["GIRAUDON Alain","2014-04-23","2014-05-30",0,"2014-05-30",0,"CP","Acceptée",{"$f":"IF(OR(G417=\"Convention\",H417=\"Refusée\"),0,IF(H417=\"Annulée\",-(NETWORKDAYS.INTL(C417,E417,1,JFERIES)-D417-F417),NETWORKDAYS.INTL(C417,E417,1,JFERIES)-D417-F417))","v":1},"2014/05"]
["GIRAUDON Alain","2014-04-23","2014-05-02",0,"2014-05-02",0,"RTT","Acceptée",{"$f":"IF(OR(G418=\"Convention\",H418=\"Refusée\"),0,IF(H418=\"Annulée\",-(NETWORKDAYS.INTL(C418,E418,1,JFERIES)-D418-F418),NETWORKDAYS.INTL(C418,E418,1,JFERIES)-D418-F418))","v":1},"2014/05"]
["GIRAUDON Alain","2014-04-23","2014-05-09",0,"2014-05-09",0,"RTT","Acceptée",{"$f":"IF(OR(G419=\"Convention\",H419=\"Refusée\"),0,IF(H419=\"Annulée\",-(NETWORKDAYS.INTL(C419,E419,1,JFERIES)-D419-F419),NETWORKDAYS.INTL(C419,E419,1,JFERIES)-D419-F419))","v":1},"2014/05"]
["SANTUCCI Lionel","2014-04-24","2014-04-29",0,"2014-04-30",0,"CP","Acceptée",{"$f":"IF(OR(G420=\"Convention\",H420=\"Refusée\"),0,IF(H420=\"Annulée\",-(NETWORKDAYS.INTL(C420,E420,1,JFERIES)-D420-F420),NETWORKDAYS.INTL(C420,E420,1,JFERIES)-D420-F420))","v":2},"2014/04"]
["SANTUCCI Lionel","2014-04-24","2014-05-02",0,"2014-05-02",0,"CP","Acceptée",{"$f":"IF(OR(G421=\"Convention\",H421=\"Refusée\"),0,IF(H421=\"Annulée\",-(NETWORKDAYS.INTL(C421,E421,1,JFERIES)-D421-F421),NETWORKDAYS.INTL(C421,E421,1,JFERIES)-D421-F421))","v":1},"2014/05"]
["SANTUCCI Lionel","2014-04-24","2014-05-12",0,"2014-05-13",0,"CP","Acceptée",{"$f":"IF(OR(G422=\"Convention\",H422=\"Refusée\"),0,IF(H422=\"Annulée\",-(NETWORKDAYS.INTL(C422,E422,1,JFERIES)-D422-F422),NETWORKDAYS.INTL(C422,E422,1,JFERIES)-D422-F422))","v":2},"2014/05"]
["SANTUCCI Lionel","2014-05-24","2014-05-26",0,"2014-05-26",0,"CP","Acceptée",{"$f":"IF(OR(G423=\"Convention\",H423=\"Refusée\"),0,IF(H423=\"Annulée\",-(NETWORKDAYS.INTL(C423,E423,1,JFERIES)-D423-F423),NETWORKDAYS.INTL(C423,E423,1,JFERIES)-D423-F423))","v":1},"2014/05"]
["DREZET Olivier","2014-04-25","2014-05-12",0,"2014-05-12",0,"CP","Acceptée",{"$f":"IF(OR(G424=\"Convention\",H424=\"Refusée\"),0,IF(H424=\"Annulée\",-(NETWORKDAYS.INTL(C424,E424,1,JFERIES)-D424-F424),NETWORKDAYS.INTL(C424,E424,1,JFERIES)-D424-F424))","v":1},"2014/05"]
["DREZET Olivier","2014-04-25","2014-05-02",0,"2014-05-02",0,"CP","Acceptée",{"$f":"IF(OR(G425=\"Convention\",H425=\"Refusée\"),0,IF(H425=\"Annulée\",-(NETWORKDAYS.INTL(C425,E425,1,JFERIES)-D425-F425),NETWORKDAYS.INTL(C425,E425,1,JFERIES)-D425-F425))","v":1},"2014/05"]
["DREZET Olivier","2014-04-28","2014-05-26",0,"2014-05-30",0,"CP","Acceptée",{"$f":"IF(OR(G426=\"Convention\",H426=\"Refusée\"),0,IF(H426=\"Annulée\",-(NETWORKDAYS.INTL(C426,E426,1,JFERIES)-D426-F426),NETWORKDAYS.INTL(C426,E426,1,JFERIES)-D426-F426))","v":4},"2014/05"]
["DREZET Olivier","2014-04-28","2014-05-09",0,"2014-05-09",0,"CP","Acceptée",{"$f":"IF(OR(G427=\"Convention\",H427=\"Refusée\"),0,IF(H427=\"Annulée\",-(NETWORKDAYS.INTL(C427,E427,1,JFERIES)-D427-F427),NETWORKDAYS.INTL(C427,E427,1,JFERIES)-D427-F427))","v":1},"2014/05"]
["DREZET Olivier","2014-04-28","2014-05-05",0,"2014-05-05",0,"CP","Acceptée",{"$f":"IF(OR(G428=\"Convention\",H428=\"Refusée\"),0,IF(H428=\"Annulée\",-(NETWORKDAYS.INTL(C428,E428,1,JFERIES)-D428-F428),NETWORKDAYS.INTL(C428,E428,1,JFERIES)-D428-F428))","v":1},"2014/05"]
["MINAKIAN Mathilde","2014-04-23","2014-05-09",0,"2014-05-09",0,"CP","Acceptée",{"$f":"IF(OR(G429=\"Convention\",H429=\"Refusée\"),0,IF(H429=\"Annulée\",-(NETWORKDAYS.INTL(C429,E429,1,JFERIES)-D429-F429),NETWORKDAYS.INTL(C429,E429,1,JFERIES)-D429-F429))","v":1},"2014/05"]
["MINAKIAN Mathilde","2014-04-23","2014-05-30",0,"2014-05-30",0,"CP","Acceptée",{"$f":"IF(OR(G430=\"Convention\",H430=\"Refusée\"),0,IF(H430=\"Annulée\",-(NETWORKDAYS.INTL(C430,E430,1,JFERIES)-D430-F430),NETWORKDAYS.INTL(C430,E430,1,JFERIES)-D430-F430))","v":1},"2014/05"]
["HAUTEBRANC Alexis","2014-04-30","2014-05-02",0,"2014-05-02",0,"CP","Acceptée",{"$f":"IF(OR(G431=\"Convention\",H431=\"Refusée\"),0,IF(H431=\"Annulée\",-(NETWORKDAYS.INTL(C431,E431,1,JFERIES)-D431-F431),NETWORKDAYS.INTL(C431,E431,1,JFERIES)-D431-F431))","v":1},"2014/05"]
["HAUTEBRANC Alexis","2014-04-30","2014-05-09",0,"2014-05-09",0,"CP","Acceptée",{"$f":"IF(OR(G432=\"Convention\",H432=\"Refusée\"),0,IF(H432=\"Annulée\",-(NETWORKDAYS.INTL(C432,E432,1,JFERIES)-D432-F432),NETWORKDAYS.INTL(C432,E432,1,JFERIES)-D432-F432))","v":1},"2014/05"]
["KADEM Christophe","2014-05-05","2014-05-22",0,"2014-05-22",0,"RTT","Acceptée",{"$f":"IF(OR(G433=\"Convention\",H433=\"Refusée\"),0,IF(H433=\"Annulée\",-(NETWORKDAYS.INTL(C433,E433,1,JFERIES)-D433-F433),NETWORKDAYS.INTL(C433,E433,1,JFERIES)-D433-F433))","v":1},"2014/05"]
["DEREPPE Bruno","2014-05-05","2014-05-09",0,"2014-05-09",0,"RTT","Acceptée",{"$f":"IF(OR(G434=\"Convention\",H434=\"Refusée\"),0,IF(H434=\"Annulée\",-(NETWORKDAYS.INTL(C434,E434,1,JFERIES)-D434-F434),NETWORKDAYS.INTL(C434,E434,1,JFERIES)-D434-F434))","v":1},"2014/05"]
["DEREPPE Bruno","2014-05-05","2014-05-30",0,"2014-05-30",0,"RTT","Acceptée",{"$f":"IF(OR(G435=\"Convention\",H435=\"Refusée\"),0,IF(H435=\"Annulée\",-(NETWORKDAYS.INTL(C435,E435,1,JFERIES)-D435-F435),NETWORKDAYS.INTL(C435,E435,1,JFERIES)-D435-F435))","v":1},"2014/05"]
["CHEVALIER Yohan","2014-05-05","2014-05-09",0,"2014-05-09",0,"CP","Acceptée",{"$f":"IF(OR(G436=\"Convention\",H436=\"Refusée\"),0,IF(H436=\"Annulée\",-(NETWORKDAYS.INTL(C436,E436,1,JFERIES)-D436-F436),NETWORKDAYS.INTL(C436,E436,1,JFERIES)-D436-F436))","v":1},"2014/05"]
["MARZOUK Sami","2014-05-05","2014-05-02",0,"2014-05-02",0,"RTT","Acceptée",{"$f":"IF(OR(G437=\"Convention\",H437=\"Refusée\"),0,IF(H437=\"Annulée\",-(NETWORKDAYS.INTL(C437,E437,1,JFERIES)-D437-F437),NETWORKDAYS.INTL(C437,E437,1,JFERIES)-D437-F437))","v":1},"2014/05"]
["MARZOUK Sami","2014-05-05","2014-05-09",0,"2014-05-09",0,"RTT","Acceptée",{"$f":"IF(OR(G438=\"Convention\",H438=\"Refusée\"),0,IF(H438=\"Annulée\",-(NETWORKDAYS.INTL(C438,E438,1,JFERIES)-D438-F438),NETWORKDAYS.INTL(C438,E438,1,JFERIES)-D438-F438))","v":1},"2014/05"]
["POMMERELL Patrick","2014-05-13","2014-05-26",0,"2014-05-26",0,"CP","Acceptée",{"$f":"IF(OR(G439=\"Convention\",H439=\"Refusée\"),0,IF(H439=\"Annulée\",-(NETWORKDAYS.INTL(C439,E439,1,JFERIES)-D439-F439),NETWORKDAYS.INTL(C439,E439,1,JFERIES)-D439-F439))","v":1},"2014/05","0,5 anticipé sur 2014-2015 accord"]
["POMMERELL Patrick","2014-05-13","2014-05-14",0,"2014-05-14",0,"RTT","Acceptée",{"$f":"IF(OR(G440=\"Convention\",H440=\"Refusée\"),0,IF(H440=\"Annulée\",-(NETWORKDAYS.INTL(C440,E440,1,JFERIES)-D440-F440),NETWORKDAYS.INTL(C440,E440,1,JFERIES)-D440-F440))","v":1},"2014/05"]
["BEARZATTO Giovanni","2014-05-13","2014-05-13",0,"2014-05-13",0,"RTT","Acceptée",{"$f":"IF(OR(G441=\"Convention\",H441=\"Refusée\"),0,IF(H441=\"Annulée\",-(NETWORKDAYS.INTL(C441,E441,1,JFERIES)-D441-F441),NETWORKDAYS.INTL(C441,E441,1,JFERIES)-D441-F441))","v":1},"2014/05"]
["HEMLER Christelle","2014-04-28","2014-04-28",0.5,"2014-04-28",0,"RTT","Acceptée",{"$f":"IF(OR(G442=\"Convention\",H442=\"Refusée\"),0,IF(H442=\"Annulée\",-(NETWORKDAYS.INTL(C442,E442,1,JFERIES)-D442-F442),NETWORKDAYS.INTL(C442,E442,1,JFERIES)-D442-F442))","v":0.5},"2014/04"]
["HEMLER Christelle","2014-04-29","2014-04-29",0,"2014-04-30",0,"CP","Acceptée",{"$f":"IF(OR(G443=\"Convention\",H443=\"Refusée\"),0,IF(H443=\"Annulée\",-(NETWORKDAYS.INTL(C443,E443,1,JFERIES)-D443-F443),NETWORKDAYS.INTL(C443,E443,1,JFERIES)-D443-F443))","v":2},"2014/04","suite TS"]
["HEMLER Christelle","2014-04-29","2014-05-02",0,"2014-05-09",0,"CP","Acceptée",{"$f":"IF(OR(G444=\"Convention\",H444=\"Refusée\"),0,IF(H444=\"Annulée\",-(NETWORKDAYS.INTL(C444,E444,1,JFERIES)-D444-F444),NETWORKDAYS.INTL(C444,E444,1,JFERIES)-D444-F444))","v":5},"2014/05","suite TS"]
["CHEVALIER Yohan","2014-05-06","2014-05-30",0,"2014-05-30",0,"CP","Acceptée",{"$f":"IF(OR(G445=\"Convention\",H445=\"Refusée\"),0,IF(H445=\"Annulée\",-(NETWORKDAYS.INTL(C445,E445,1,JFERIES)-D445-F445),NETWORKDAYS.INTL(C445,E445,1,JFERIES)-D445-F445))","v":1},"2014/05"]
["GUINOT Nathalie","2014-02-24","2014-02-24",0,"2014-02-28",0,"CP","Acceptée",{"$f":"IF(OR(G446=\"Convention\",H446=\"Refusée\"),0,IF(H446=\"Annulée\",-(NETWORKDAYS.INTL(C446,E446,1,JFERIES)-D446-F446),NETWORKDAYS.INTL(C446,E446,1,JFERIES)-D446-F446))","v":5},"2014/02"]
["GUINOT Nathalie","2014-05-06","2014-05-09",0,"2014-05-09",0,"CP","Acceptée",{"$f":"IF(OR(G447=\"Convention\",H447=\"Refusée\"),0,IF(H447=\"Annulée\",-(NETWORKDAYS.INTL(C447,E447,1,JFERIES)-D447-F447),NETWORKDAYS.INTL(C447,E447,1,JFERIES)-D447-F447))","v":1},"2014/05"]
["GUINOT Nathalie","2014-05-19","2014-05-28",0,"2014-05-30",0,"CP","Acceptée",{"$f":"IF(OR(G448=\"Convention\",H448=\"Refusée\"),0,IF(H448=\"Annulée\",-(NETWORKDAYS.INTL(C448,E448,1,JFERIES)-D448-F448),NETWORKDAYS.INTL(C448,E448,1,JFERIES)-D448-F448))","v":2},"2014/05"]
["HAUTEBRANC Alexis","2014-05-19","2014-06-09",0,"2014-06-09",0,"RTT","Acceptée",{"$f":"IF(OR(G449=\"Convention\",H449=\"Refusée\"),0,IF(H449=\"Annulée\",-(NETWORKDAYS.INTL(C449,E449,1,JFERIES)-D449-F449),NETWORKDAYS.INTL(C449,E449,1,JFERIES)-D449-F449))","v":1},"2014/06","journée solidarité"]
["HAUTEBRANC Alexis","2014-05-04","2014-06-02",0,"2014-06-02",0,"RTT","Acceptée",{"$f":"IF(OR(G450=\"Convention\",H450=\"Refusée\"),0,IF(H450=\"Annulée\",-(NETWORKDAYS.INTL(C450,E450,1,JFERIES)-D450-F450),NETWORKDAYS.INTL(C450,E450,1,JFERIES)-D450-F450))","v":1},"2014/06"]
["GUERIN Viviane","2014-06-02","2014-06-02",0,"2014-06-02",0,"CP","Acceptée",{"$f":"IF(OR(G451=\"Convention\",H451=\"Refusée\"),0,IF(H451=\"Annulée\",-(NETWORKDAYS.INTL(C451,E451,1,JFERIES)-D451-F451),NETWORKDAYS.INTL(C451,E451,1,JFERIES)-D451-F451))","v":1},"2014/06"]
["VAUTRAIN Franck","2014-06-02","2014-06-02",0.5,"2014-06-02",0,"RTT","Acceptée",{"$f":"IF(OR(G452=\"Convention\",H452=\"Refusée\"),0,IF(H452=\"Annulée\",-(NETWORKDAYS.INTL(C452,E452,1,JFERIES)-D452-F452),NETWORKDAYS.INTL(C452,E452,1,JFERIES)-D452-F452))","v":0.5},"2014/06"]
["GUERIN Viviane","2014-05-19","2014-07-15",0,"2014-07-15",0,"CP","Acceptée",{"$f":"IF(OR(G453=\"Convention\",H453=\"Refusée\"),0,IF(H453=\"Annulée\",-(NETWORKDAYS.INTL(C453,E453,1,JFERIES)-D453-F453),NETWORKDAYS.INTL(C453,E453,1,JFERIES)-D453-F453))","v":1},"2014/07","solde 2013-2014"]
["MINAKIAN Mathilde","2014-05-19","2014-07-11",0,"2014-07-11",0,"CP","Acceptée",{"$f":"IF(OR(G454=\"Convention\",H454=\"Refusée\"),0,IF(H454=\"Annulée\",-(NETWORKDAYS.INTL(C454,E454,1,JFERIES)-D454-F454),NETWORKDAYS.INTL(C454,E454,1,JFERIES)-D454-F454))","v":1},"2014/07"]
["TAQUET Alain","2014-05-19","2014-06-09",0,"2014-06-09",0,"RTD Recup","Acceptée",{"$f":"IF(OR(G455=\"Convention\",H455=\"Refusée\"),0,IF(H455=\"Annulée\",-(NETWORKDAYS.INTL(C455,E455,1,JFERIES)-D455-F455),NETWORKDAYS.INTL(C455,E455,1,JFERIES)-D455-F455))","v":1},"2014/06","solde 2013"]
["TAQUET Alain","2014-05-19","2014-06-10",0,"2014-06-11",0,"CP","Acceptée",{"$f":"IF(OR(G456=\"Convention\",H456=\"Refusée\"),0,IF(H456=\"Annulée\",-(NETWORKDAYS.INTL(C456,E456,1,JFERIES)-D456-F456),NETWORKDAYS.INTL(C456,E456,1,JFERIES)-D456-F456))","v":2},"2014/06","solde 2013-2014"]
["GUIOT Fabien","2014-05-19","2014-05-26",0,"2014-05-26",0,"RTT","Acceptée",{"$f":"IF(OR(G457=\"Convention\",H457=\"Refusée\"),0,IF(H457=\"Annulée\",-(NETWORKDAYS.INTL(C457,E457,1,JFERIES)-D457-F457),NETWORKDAYS.INTL(C457,E457,1,JFERIES)-D457-F457))","v":1},"2014/05"]
["GUIOT Fabien","2014-05-19","2014-05-30",0,"2014-05-30",0,"RTT","Acceptée",{"$f":"IF(OR(G458=\"Convention\",H458=\"Refusée\"),0,IF(H458=\"Annulée\",-(NETWORKDAYS.INTL(C458,E458,1,JFERIES)-D458-F458),NETWORKDAYS.INTL(C458,E458,1,JFERIES)-D458-F458))","v":1},"2014/05"]
["GUIOT Fabien","2014-05-19","2014-05-28",0,"2014-05-28",0,"CP","Acceptée",{"$f":"IF(OR(G459=\"Convention\",H459=\"Refusée\"),0,IF(H459=\"Annulée\",-(NETWORKDAYS.INTL(C459,E459,1,JFERIES)-D459-F459),NETWORKDAYS.INTL(C459,E459,1,JFERIES)-D459-F459))","v":1},"2014/05"]
["LOCATELLI Bruno","2014-05-20","2014-06-05",0.5,"2014-06-05",0,"RTT","Refusée",{"$f":"IF(OR(G460=\"Convention\",H460=\"Refusée\"),0,IF(H460=\"Annulée\",-(NETWORKDAYS.INTL(C460,E460,1,JFERIES)-D460-F460),NETWORKDAYS.INTL(C460,E460,1,JFERIES)-D460-F460))","v":0},"2014/06","Reel Annulé par BL par mail du 04/06/2014"]
["MARZOUK Sami","2014-05-23","2014-05-30",0,"2014-05-30",0,"CP","Acceptée",{"$f":"IF(OR(G461=\"Convention\",H461=\"Refusée\"),0,IF(H461=\"Annulée\",-(NETWORKDAYS.INTL(C461,E461,1,JFERIES)-D461-F461),NETWORKDAYS.INTL(C461,E461,1,JFERIES)-D461-F461))","v":1},"2014/05"]
["COUTANT Jean Paul","2014-05-25","2014-05-23",0,"2014-05-23",0,"RTT","Acceptée",{"$f":"IF(OR(G462=\"Convention\",H462=\"Refusée\"),0,IF(H462=\"Annulée\",-(NETWORKDAYS.INTL(C462,E462,1,JFERIES)-D462-F462),NETWORKDAYS.INTL(C462,E462,1,JFERIES)-D462-F462))","v":1},"2014/05","RTT pour maladie"]
["LEDANT Charles","2014-05-12","2014-06-09",0,"2014-06-09",0,"RTT","Acceptée",{"$f":"IF(OR(G463=\"Convention\",H463=\"Refusée\"),0,IF(H463=\"Annulée\",-(NETWORKDAYS.INTL(C463,E463,1,JFERIES)-D463-F463),NETWORKDAYS.INTL(C463,E463,1,JFERIES)-D463-F463))","v":1},"2014/06"]
["SIODMAK Eric","2014-05-26","2014-06-04",0,"2014-06-04",0.5,"RTT","Acceptée",{"$f":"IF(OR(G464=\"Convention\",H464=\"Refusée\"),0,IF(H464=\"Annulée\",-(NETWORKDAYS.INTL(C464,E464,1,JFERIES)-D464-F464),NETWORKDAYS.INTL(C464,E464,1,JFERIES)-D464-F464))","v":0.5},"2014/06"]
["SIODMAK Eric","2014-05-26","2014-06-09",0,"2014-06-09",0,"RTT","Acceptée",{"$f":"IF(OR(G465=\"Convention\",H465=\"Refusée\"),0,IF(H465=\"Annulée\",-(NETWORKDAYS.INTL(C465,E465,1,JFERIES)-D465-F465),NETWORKDAYS.INTL(C465,E465,1,JFERIES)-D465-F465))","v":1},"2014/06","Via 2 demandes"]
["SIODMAK Eric","2014-05-26","2014-06-17",0.5,"2014-06-17",0,"RTT","Acceptée",{"$f":"IF(OR(G466=\"Convention\",H466=\"Refusée\"),0,IF(H466=\"Annulée\",-(NETWORKDAYS.INTL(C466,E466,1,JFERIES)-D466-F466),NETWORKDAYS.INTL(C466,E466,1,JFERIES)-D466-F466))","v":0.5},"2014/06"]
["LOYER Michel","2014-05-26","2014-06-25",0,"2014-06-25",0,"CP","Acceptée",{"$f":"IF(OR(G467=\"Convention\",H467=\"Refusée\"),0,IF(H467=\"Annulée\",-(NETWORKDAYS.INTL(C467,E467,1,JFERIES)-D467-F467),NETWORKDAYS.INTL(C467,E467,1,JFERIES)-D467-F467))","v":1},"2014/06"]
["LOYER Michel","2014-06-26","2014-06-26",0,"2014-06-26",0,"RTT","Acceptée",{"$f":"IF(OR(G468=\"Convention\",H468=\"Refusée\"),0,IF(H468=\"Annulée\",-(NETWORKDAYS.INTL(C468,E468,1,JFERIES)-D468-F468),NETWORKDAYS.INTL(C468,E468,1,JFERIES)-D468-F468))","v":1},"2014/06"]
["LOYER Michel","2014-05-26","2014-05-30",0,"2014-05-30",0,"RTT","Acceptée",{"$f":"IF(OR(G469=\"Convention\",H469=\"Refusée\"),0,IF(H469=\"Annulée\",-(NETWORKDAYS.INTL(C469,E469,1,JFERIES)-D469-F469),NETWORKDAYS.INTL(C469,E469,1,JFERIES)-D469-F469))","v":1},"2014/05"]
["COUTANT Jean Paul","2014-06-02","2014-06-04",0,"2014-06-04",0,"CP","Acceptée",{"$f":"IF(OR(G470=\"Convention\",H470=\"Refusée\"),0,IF(H470=\"Annulée\",-(NETWORKDAYS.INTL(C470,E470,1,JFERIES)-D470-F470),NETWORKDAYS.INTL(C470,E470,1,JFERIES)-D470-F470))","v":1},"2014/06"]
["DREZET Olivier","2014-06-11","2014-06-13",0,"2014-06-13",0,"CP","Acceptée",{"$f":"IF(OR(G471=\"Convention\",H471=\"Refusée\"),0,IF(H471=\"Annulée\",-(NETWORKDAYS.INTL(C471,E471,1,JFERIES)-D471-F471),NETWORKDAYS.INTL(C471,E471,1,JFERIES)-D471-F471))","v":1},"2014/06","CP N-1"]
["MARZOUK Sami","2014-05-05","2014-05-30",0,"2014-05-30",0,"RTT","Acceptée",{"$f":"IF(OR(G472=\"Convention\",H472=\"Refusée\"),0,IF(H472=\"Annulée\",-(NETWORKDAYS.INTL(C472,E472,1,JFERIES)-D472-F472),NETWORKDAYS.INTL(C472,E472,1,JFERIES)-D472-F472))","v":1},"2014/05"]
["POMMERELL Patrick","2014-06-17","2014-06-24",0,"2014-06-24",0,"RTT","Acceptée",{"$f":"IF(OR(G473=\"Convention\",H473=\"Refusée\"),0,IF(H473=\"Annulée\",-(NETWORKDAYS.INTL(C473,E473,1,JFERIES)-D473-F473),NETWORKDAYS.INTL(C473,E473,1,JFERIES)-D473-F473))","v":1},"2014/06"]
["GUINOT Nathalie","2014-06-17","2014-08-08",0,"2014-08-29",0,"CP","Acceptée",{"$f":"IF(OR(G474=\"Convention\",H474=\"Refusée\"),0,IF(H474=\"Annulée\",-(NETWORKDAYS.INTL(C474,E474,1,JFERIES)-D474-F474),NETWORKDAYS.INTL(C474,E474,1,JFERIES)-D474-F474))","v":15},"2014/08","Congés eté 2014"]
["DEREPPE Bruno","2014-06-17","2014-07-28",0,"2014-07-31",0,"CP","Acceptée",{"$f":"IF(OR(G475=\"Convention\",H475=\"Refusée\"),0,IF(H475=\"Annulée\",-(NETWORKDAYS.INTL(C475,E475,1,JFERIES)-D475-F475),NETWORKDAYS.INTL(C475,E475,1,JFERIES)-D475-F475))","v":4},"2014/07","Congés eté 2014"]
["DEREPPE Bruno","2014-06-17","2014-08-01",0,"2014-08-14",0,"CP","Acceptée",{"$f":"IF(OR(G476=\"Convention\",H476=\"Refusée\"),0,IF(H476=\"Annulée\",-(NETWORKDAYS.INTL(C476,E476,1,JFERIES)-D476-F476),NETWORKDAYS.INTL(C476,E476,1,JFERIES)-D476-F476))","v":10},"2014/08","Congés eté 2014"]
["DEREPPE Bruno","2014-06-17","2014-09-01",0,"2014-09-05",0,"CP","Acceptée",{"$f":"IF(OR(G477=\"Convention\",H477=\"Refusée\"),0,IF(H477=\"Annulée\",-(NETWORKDAYS.INTL(C477,E477,1,JFERIES)-D477-F477),NETWORKDAYS.INTL(C477,E477,1,JFERIES)-D477-F477))","v":5},"2014/09","Congés eté 2014"]
["COUTANT Jean Paul","2014-06-17","2014-08-08",0,"2014-08-29",0,"CP","Acceptée",{"$f":"IF(OR(G478=\"Convention\",H478=\"Refusée\"),0,IF(H478=\"Annulée\",-(NETWORKDAYS.INTL(C478,E478,1,JFERIES)-D478-F478),NETWORKDAYS.INTL(C478,E478,1,JFERIES)-D478-F478))","v":15},"2014/08","Congés eté 2014"]
["LOCATELLI Bruno","2014-05-15","2014-08-25",0,"2014-08-29",0,"CP","Acceptée",{"$f":"IF(OR(G479=\"Convention\",H479=\"Refusée\"),0,IF(H479=\"Annulée\",-(NETWORKDAYS.INTL(C479,E479,1,JFERIES)-D479-F479),NETWORKDAYS.INTL(C479,E479,1,JFERIES)-D479-F479))","v":5},"2014/08","Congés eté 2014"]
["LOCATELLI Bruno","2014-05-15","2014-09-01",0,"2014-09-05",0,"CP","Acceptée",{"$f":"IF(OR(G480=\"Convention\",H480=\"Refusée\"),0,IF(H480=\"Annulée\",-(NETWORKDAYS.INTL(C480,E480,1,JFERIES)-D480-F480),NETWORKDAYS.INTL(C480,E480,1,JFERIES)-D480-F480))","v":5},"2014/09","Congés eté 2014"]
["LOCATELLI Bruno","2014-05-15","2014-09-22",0,"2014-09-26",0,"CP","Acceptée",{"$f":"IF(OR(G481=\"Convention\",H481=\"Refusée\"),0,IF(H481=\"Annulée\",-(NETWORKDAYS.INTL(C481,E481,1,JFERIES)-D481-F481),NETWORKDAYS.INTL(C481,E481,1,JFERIES)-D481-F481))","v":5},"2014/09","ACCORD EXCEPTIONNEL Congés eté 2014"]
["POMMERELL Patrick","2014-03-17","2014-08-01",0,"2014-08-24",0,"CP","Acceptée",{"$f":"IF(OR(G482=\"Convention\",H482=\"Refusée\"),0,IF(H482=\"Annulée\",-(NETWORKDAYS.INTL(C482,E482,1,JFERIES)-D482-F482),NETWORKDAYS.INTL(C482,E482,1,JFERIES)-D482-F482))","v":15},"2014/08","Congés eté 2014"]
["VAUTRAIN Franck","2014-03-27","2014-08-04",0,"2014-08-25",0,"CP","Acceptée",{"$f":"IF(OR(G483=\"Convention\",H483=\"Refusée\"),0,IF(H483=\"Annulée\",-(NETWORKDAYS.INTL(C483,E483,1,JFERIES)-D483-F483),NETWORKDAYS.INTL(C483,E483,1,JFERIES)-D483-F483))","v":15},"2014/08","Congés eté 2014"]
["GUERIN Viviane","2014-03-21","2014-08-06",0,"2014-08-08",0,"CP","Acceptée",{"$f":"IF(OR(G484=\"Convention\",H484=\"Refusée\"),0,IF(H484=\"Annulée\",-(NETWORKDAYS.INTL(C484,E484,1,JFERIES)-D484-F484),NETWORKDAYS.INTL(C484,E484,1,JFERIES)-D484-F484))","v":3},"2014/08","Solde N-1"]
["GUERIN Viviane","2014-03-21","2014-08-11",0,"2014-08-29",0,"CP","Acceptée",{"$f":"IF(OR(G485=\"Convention\",H485=\"Refusée\"),0,IF(H485=\"Annulée\",-(NETWORKDAYS.INTL(C485,E485,1,JFERIES)-D485-F485),NETWORKDAYS.INTL(C485,E485,1,JFERIES)-D485-F485))","v":14},"2014/08","Congés eté 2014"]
["GUERIN Viviane","2014-03-21","2014-09-01",0,"2014-09-01",0,"CP","Acceptée",{"$f":"IF(OR(G486=\"Convention\",H486=\"Refusée\"),0,IF(H486=\"Annulée\",-(NETWORKDAYS.INTL(C486,E486,1,JFERIES)-D486-F486),NETWORKDAYS.INTL(C486,E486,1,JFERIES)-D486-F486))","v":1},"2014/09","Congés eté 2014"]
["GUERIN Viviane","2014-03-21","2014-09-02",0,"2014-09-02",0,"RTT","Acceptée",{"$f":"IF(OR(G487=\"Convention\",H487=\"Refusée\"),0,IF(H487=\"Annulée\",-(NETWORKDAYS.INTL(C487,E487,1,JFERIES)-D487-F487),NETWORKDAYS.INTL(C487,E487,1,JFERIES)-D487-F487))","v":1},"2014/09"]
["LEDANT Charles","2014-02-14","2014-08-04",0,"2014-08-27",0,"CP","Acceptée",{"$f":"IF(OR(G488=\"Convention\",H488=\"Refusée\"),0,IF(H488=\"Annulée\",-(NETWORKDAYS.INTL(C488,E488,1,JFERIES)-D488-F488),NETWORKDAYS.INTL(C488,E488,1,JFERIES)-D488-F488))","v":17},"2014/08","Congés eté 2014"]
["MARAIS Bernard","2014-02-12","2014-08-18",0,"2014-08-25",0,"CP","Acceptée",{"$f":"IF(OR(G489=\"Convention\",H489=\"Refusée\"),0,IF(H489=\"Annulée\",-(NETWORKDAYS.INTL(C489,E489,1,JFERIES)-D489-F489),NETWORKDAYS.INTL(C489,E489,1,JFERIES)-D489-F489))","v":6},"2014/08","Congés eté 2014"]
["MARAIS Bernard","2014-02-12","2014-09-29",0,"2014-10-10",0,"CP","Acceptée",{"$f":"IF(OR(G490=\"Convention\",H490=\"Refusée\"),0,IF(H490=\"Annulée\",-(NETWORKDAYS.INTL(C490,E490,1,JFERIES)-D490-F490),NETWORKDAYS.INTL(C490,E490,1,JFERIES)-D490-F490))","v":10},"2014/10","ACCORD EXCEPTIONNEL Congés eté 2014"]
["PLONQUET Christian","2014-04-07","2014-09-01",0,"2014-09-05",0,"CP","Acceptée",{"$f":"IF(OR(G491=\"Convention\",H491=\"Refusée\"),0,IF(H491=\"Annulée\",-(NETWORKDAYS.INTL(C491,E491,1,JFERIES)-D491-F491),NETWORKDAYS.INTL(C491,E491,1,JFERIES)-D491-F491))","v":5},"2014/09","Congés eté 2014"]
["PLONQUET Christian","2014-04-07","2014-07-15",0,"2014-07-23",0,"Convention","Acceptée",{"$f":"IF(OR(G492=\"Convention\",H492=\"Refusée\"),0,IF(H492=\"Annulée\",-(NETWORKDAYS.INTL(C492,E492,1,JFERIES)-D492-F492),NETWORKDAYS.INTL(C492,E492,1,JFERIES)-D492-F492))","v":0},"2014/07","RECUP"]
["KADEM Christophe","2014-04-10","2014-08-04",0,"2014-08-25",0,"CP","Acceptée",{"$f":"IF(OR(G493=\"Convention\",H493=\"Refusée\"),0,IF(H493=\"Annulée\",-(NETWORKDAYS.INTL(C493,E493,1,JFERIES)-D493-F493),NETWORKDAYS.INTL(C493,E493,1,JFERIES)-D493-F493))","v":15},"2014/08","Congés eté 2014"]
["BEARZATTO Giovanni","2014-06-17","2014-08-18",0,"2014-08-31",0,"CP","Acceptée",{"$f":"IF(OR(G494=\"Convention\",H494=\"Refusée\"),0,IF(H494=\"Annulée\",-(NETWORKDAYS.INTL(C494,E494,1,JFERIES)-D494-F494),NETWORKDAYS.INTL(C494,E494,1,JFERIES)-D494-F494))","v":10},"2014/08","Congés eté 2014"]
["BEARZATTO Giovanni","2014-06-17","2014-09-01",0,"2014-09-08",0,"CP","Acceptée",{"$f":"IF(OR(G495=\"Convention\",H495=\"Refusée\"),0,IF(H495=\"Annulée\",-(NETWORKDAYS.INTL(C495,E495,1,JFERIES)-D495-F495),NETWORKDAYS.INTL(C495,E495,1,JFERIES)-D495-F495))","v":6},"2014/09","Congés eté 2014"]
["HAUTEBRANC Alexis","2014-06-05","2014-07-28",0,"2014-07-31",0,"CP","Acceptée",{"$f":"IF(OR(G496=\"Convention\",H496=\"Refusée\"),0,IF(H496=\"Annulée\",-(NETWORKDAYS.INTL(C496,E496,1,JFERIES)-D496-F496),NETWORKDAYS.INTL(C496,E496,1,JFERIES)-D496-F496))","v":4},"2014/07","Congés eté 2014"]
["HAUTEBRANC Alexis","2014-06-05","2014-08-01",0,"2014-08-08",0,"CP","Acceptée",{"$f":"IF(OR(G497=\"Convention\",H497=\"Refusée\"),0,IF(H497=\"Annulée\",-(NETWORKDAYS.INTL(C497,E497,1,JFERIES)-D497-F497),NETWORKDAYS.INTL(C497,E497,1,JFERIES)-D497-F497))","v":6},"2014/08","Congés eté 2014"]
["MINAKIAN Mathilde","2014-06-05","2014-08-01",0,"2014-08-22",0,"CP","Acceptée",{"$f":"IF(OR(G498=\"Convention\",H498=\"Refusée\"),0,IF(H498=\"Annulée\",-(NETWORKDAYS.INTL(C498,E498,1,JFERIES)-D498-F498),NETWORKDAYS.INTL(C498,E498,1,JFERIES)-D498-F498))","v":15},"2014/08","Congés eté 2014"]
["HAUTEBRANC Alexis","2014-06-05","2014-09-01",0,"2014-09-05",0,"CP","Acceptée",{"$f":"IF(OR(G499=\"Convention\",H499=\"Refusée\"),0,IF(H499=\"Annulée\",-(NETWORKDAYS.INTL(C499,E499,1,JFERIES)-D499-F499),NETWORKDAYS.INTL(C499,E499,1,JFERIES)-D499-F499))","v":5},"2014/09","Congés eté 2014"]
["LAZZARO Fabien","2014-05-19","2014-05-27",0,"2014-05-27",0,"RTT","Acceptée",{"$f":"IF(OR(G500=\"Convention\",H500=\"Refusée\"),0,IF(H500=\"Annulée\",-(NETWORKDAYS.INTL(C500,E500,1,JFERIES)-D500-F500),NETWORKDAYS.INTL(C500,E500,1,JFERIES)-D500-F500))","v":1},"2014/05"]
["LAZZARO Fabien","2014-05-19","2014-07-28",0,"2014-07-31",0,"CP","Acceptée",{"$f":"IF(OR(G501=\"Convention\",H501=\"Refusée\"),0,IF(H501=\"Annulée\",-(NETWORKDAYS.INTL(C501,E501,1,JFERIES)-D501-F501),NETWORKDAYS.INTL(C501,E501,1,JFERIES)-D501-F501))","v":4},"2014/07","Congés eté 2014"]
["LAZZARO Fabien","2014-05-19","2014-08-01",0,"2014-08-18",0,"CP","Acceptée",{"$f":"IF(OR(G502=\"Convention\",H502=\"Refusée\"),0,IF(H502=\"Annulée\",-(NETWORKDAYS.INTL(C502,E502,1,JFERIES)-D502-F502),NETWORKDAYS.INTL(C502,E502,1,JFERIES)-D502-F502))","v":11},"2014/08","Congés eté 2014"]
["LAZZARO Fabien","2014-02-20","2014-11-10",0,"2014-11-10",0,"RTT","Acceptée",{"$f":"IF(OR(G503=\"Convention\",H503=\"Refusée\"),0,IF(H503=\"Annulée\",-(NETWORKDAYS.INTL(C503,E503,1,JFERIES)-D503-F503),NETWORKDAYS.INTL(C503,E503,1,JFERIES)-D503-F503))","v":1},"2014/11"]
["SIODMAK Eric","2014-06-17","2014-08-11",0,"2014-08-31",0,"CP","Acceptée",{"$f":"IF(OR(G504=\"Convention\",H504=\"Refusée\"),0,IF(H504=\"Annulée\",-(NETWORKDAYS.INTL(C504,E504,1,JFERIES)-D504-F504),NETWORKDAYS.INTL(C504,E504,1,JFERIES)-D504-F504))","v":14},"2014/08","Congés eté 2014"]
["SIODMAK Eric","2014-06-17","2014-09-01",0,"2014-09-02",0,"CP","Acceptée",{"$f":"IF(OR(G505=\"Convention\",H505=\"Refusée\"),0,IF(H505=\"Annulée\",-(NETWORKDAYS.INTL(C505,E505,1,JFERIES)-D505-F505),NETWORKDAYS.INTL(C505,E505,1,JFERIES)-D505-F505))","v":2},"2014/09","Congés eté 2014"]
["TAQUET Alain","2014-06-17","2014-08-11",0,"2014-08-29",0,"CP","Acceptée",{"$f":"IF(OR(G506=\"Convention\",H506=\"Refusée\"),0,IF(H506=\"Annulée\",-(NETWORKDAYS.INTL(C506,E506,1,JFERIES)-D506-F506),NETWORKDAYS.INTL(C506,E506,1,JFERIES)-D506-F506))","v":14},"2014/08","Congés eté 2014"]
["SOUCHET Alain","2014-06-17","2014-08-04",0,"2014-09-01",0,"CP","Acceptée",{"$f":"IF(OR(G507=\"Convention\",H507=\"Refusée\"),0,IF(H507=\"Annulée\",-(NETWORKDAYS.INTL(C507,E507,1,JFERIES)-D507-F507),NETWORKDAYS.INTL(C507,E507,1,JFERIES)-D507-F507))","v":20},"2014/09","Congés eté 2014"]
["DREVON Alain","2014-06-17","2014-07-28",0,"2014-07-31",0,"CP","Acceptée",{"$f":"IF(OR(G508=\"Convention\",H508=\"Refusée\"),0,IF(H508=\"Annulée\",-(NETWORKDAYS.INTL(C508,E508,1,JFERIES)-D508-F508),NETWORKDAYS.INTL(C508,E508,1,JFERIES)-D508-F508))","v":4},"2014/07","Congés eté 2014"]
["DREVON Alain","2014-06-17","2014-08-01",0,"2014-08-08",0,"CP","Acceptée",{"$f":"IF(OR(G509=\"Convention\",H509=\"Refusée\"),0,IF(H509=\"Annulée\",-(NETWORKDAYS.INTL(C509,E509,1,JFERIES)-D509-F509),NETWORKDAYS.INTL(C509,E509,1,JFERIES)-D509-F509))","v":6},"2014/08","Congés eté 2014"]
["DREVON Alain","2014-06-17","2014-08-27",0.5,"2014-08-31",0,"CP","Acceptée",{"$f":"IF(OR(G510=\"Convention\",H510=\"Refusée\"),0,IF(H510=\"Annulée\",-(NETWORKDAYS.INTL(C510,E510,1,JFERIES)-D510-F510),NETWORKDAYS.INTL(C510,E510,1,JFERIES)-D510-F510))","v":2.5},"2014/08","Congés eté 2014"]
["DREVON Alain","2014-06-17","2014-09-01",0,"2014-09-05",0,"CP","Acceptée",{"$f":"IF(OR(G511=\"Convention\",H511=\"Refusée\"),0,IF(H511=\"Annulée\",-(NETWORKDAYS.INTL(C511,E511,1,JFERIES)-D511-F511),NETWORKDAYS.INTL(C511,E511,1,JFERIES)-D511-F511))","v":5},"2014/09","Congés eté 2014"]
["PONS Olivier","2014-06-17","2014-06-23",0,"2014-06-23",0,"RTT","Refusée",{"$f":"IF(OR(G512=\"Convention\",H512=\"Refusée\"),0,IF(H512=\"Annulée\",-(NETWORKDAYS.INTL(C512,E512,1,JFERIES)-D512-F512),NETWORKDAYS.INTL(C512,E512,1,JFERIES)-D512-F512))","v":0},"2014/06","Reel Annulé par mail du 20/06/2014"]
["BERTHE Magali","2014-06-17","2014-08-11",0,"2014-08-24",0,"CP","Acceptée",{"$f":"IF(OR(G513=\"Convention\",H513=\"Refusée\"),0,IF(H513=\"Annulée\",-(NETWORKDAYS.INTL(C513,E513,1,JFERIES)-D513-F513),NETWORKDAYS.INTL(C513,E513,1,JFERIES)-D513-F513))","v":9},"2014/08","Congés eté 2014"]
["GUIOT Fabien","2014-02-17","2014-08-11",0,"2014-08-29",0,"CP","Acceptée",{"$f":"IF(OR(G514=\"Convention\",H514=\"Refusée\"),0,IF(H514=\"Annulée\",-(NETWORKDAYS.INTL(C514,E514,1,JFERIES)-D514-F514),NETWORKDAYS.INTL(C514,E514,1,JFERIES)-D514-F514))","v":14},"2014/08","Congés eté 2014"]
["GIRAUDON Alain","2014-06-18","2014-08-01",0,"2014-08-29",0,"CP","Acceptée",{"$f":"IF(OR(G515=\"Convention\",H515=\"Refusée\"),0,IF(H515=\"Annulée\",-(NETWORKDAYS.INTL(C515,E515,1,JFERIES)-D515-F515),NETWORKDAYS.INTL(C515,E515,1,JFERIES)-D515-F515))","v":20},"2014/08","Congés eté 2014"]
["SANTUCCI Lionel","2014-06-18","2014-07-29",0.5,"2014-07-29",0,"RTT","Acceptée",{"$f":"IF(OR(G516=\"Convention\",H516=\"Refusée\"),0,IF(H516=\"Annulée\",-(NETWORKDAYS.INTL(C516,E516,1,JFERIES)-D516-F516),NETWORKDAYS.INTL(C516,E516,1,JFERIES)-D516-F516))","v":0.5},"2014/07"]
["DREZET Olivier","2014-06-18","2014-08-07",0,"2014-08-31",0,"CP","Acceptée",{"$f":"IF(OR(G517=\"Convention\",H517=\"Refusée\"),0,IF(H517=\"Annulée\",-(NETWORKDAYS.INTL(C517,E517,1,JFERIES)-D517-F517),NETWORKDAYS.INTL(C517,E517,1,JFERIES)-D517-F517))","v":16},"2014/08","Congés eté 2014"]
["DREZET Olivier","2014-06-18","2014-09-01",0,"2014-09-04",0,"CP","Acceptée",{"$f":"IF(OR(G518=\"Convention\",H518=\"Refusée\"),0,IF(H518=\"Annulée\",-(NETWORKDAYS.INTL(C518,E518,1,JFERIES)-D518-F518),NETWORKDAYS.INTL(C518,E518,1,JFERIES)-D518-F518))","v":4},"2014/09","Congés eté 2014"]
["TAQUET Alain","2014-06-25","2014-07-18",0.5,"2014-07-21",0.5,"RTT","Acceptée",{"$f":"IF(OR(G519=\"Convention\",H519=\"Refusée\"),0,IF(H519=\"Annulée\",-(NETWORKDAYS.INTL(C519,E519,1,JFERIES)-D519-F519),NETWORKDAYS.INTL(C519,E519,1,JFERIES)-D519-F519))","v":1},"2014/07"]
["COUTANT Jean Paul","2014-06-23","2014-07-16",0,"2014-07-16",0,"RTT","Acceptée",{"$f":"IF(OR(G520=\"Convention\",H520=\"Refusée\"),0,IF(H520=\"Annulée\",-(NETWORKDAYS.INTL(C520,E520,1,JFERIES)-D520-F520),NETWORKDAYS.INTL(C520,E520,1,JFERIES)-D520-F520))","v":1},"2014/07"]
["GIRAUDON Alain","2014-06-23","2014-06-27",0,"2014-06-27",0,"CP","Acceptée",{"$f":"IF(OR(G521=\"Convention\",H521=\"Refusée\"),0,IF(H521=\"Annulée\",-(NETWORKDAYS.INTL(C521,E521,1,JFERIES)-D521-F521),NETWORKDAYS.INTL(C521,E521,1,JFERIES)-D521-F521))","v":1},"2014/06"]
["LOYER Michel","2014-06-30","2014-07-21",0,"2014-07-21",0,"RTT","Acceptée",{"$f":"IF(OR(G522=\"Convention\",H522=\"Refusée\"),0,IF(H522=\"Annulée\",-(NETWORKDAYS.INTL(C522,E522,1,JFERIES)-D522-F522),NETWORKDAYS.INTL(C522,E522,1,JFERIES)-D522-F522))","v":1},"2014/07"]
["LOYER Michel","2014-06-30","2014-07-28",0,"2014-07-28",0,"RTT","Acceptée",{"$f":"IF(OR(G523=\"Convention\",H523=\"Refusée\"),0,IF(H523=\"Annulée\",-(NETWORKDAYS.INTL(C523,E523,1,JFERIES)-D523-F523),NETWORKDAYS.INTL(C523,E523,1,JFERIES)-D523-F523))","v":1},"2014/07"]
["LOYER Michel","2014-06-30","2014-07-22",0,"2014-07-25",0,"CP","Acceptée",{"$f":"IF(OR(G524=\"Convention\",H524=\"Refusée\"),0,IF(H524=\"Annulée\",-(NETWORKDAYS.INTL(C524,E524,1,JFERIES)-D524-F524),NETWORKDAYS.INTL(C524,E524,1,JFERIES)-D524-F524))","v":4},"2014/07","ACCORD EXCEPTIONNEL Congés eté 2014"]
["LOYER Michel","2014-06-30","2014-07-29",0,"2014-07-31",0,"CP","Acceptée",{"$f":"IF(OR(G525=\"Convention\",H525=\"Refusée\"),0,IF(H525=\"Annulée\",-(NETWORKDAYS.INTL(C525,E525,1,JFERIES)-D525-F525),NETWORKDAYS.INTL(C525,E525,1,JFERIES)-D525-F525))","v":3},"2014/07","Congés eté 2014"]
["LOYER Michel","2014-06-30","2014-08-01",0,"2014-08-14",0,"CP","Acceptée",{"$f":"IF(OR(G526=\"Convention\",H526=\"Refusée\"),0,IF(H526=\"Annulée\",-(NETWORKDAYS.INTL(C526,E526,1,JFERIES)-D526-F526),NETWORKDAYS.INTL(C526,E526,1,JFERIES)-D526-F526))","v":10},"2014/08","Congés eté 2014"]
["ROBIN Kevin","2014-07-01","2014-07-18",0.5,"2014-07-21",0.5,"CP","Acceptée",{"$f":"IF(OR(G527=\"Convention\",H527=\"Refusée\"),0,IF(H527=\"Annulée\",-(NETWORKDAYS.INTL(C527,E527,1,JFERIES)-D527-F527),NETWORKDAYS.INTL(C527,E527,1,JFERIES)-D527-F527))","v":1},"2014/07"]
["ROBIN Kevin","2014-07-01","2014-08-08",0,"2014-08-29",0,"CP","Acceptée",{"$f":"IF(OR(G528=\"Convention\",H528=\"Refusée\"),0,IF(H528=\"Annulée\",-(NETWORKDAYS.INTL(C528,E528,1,JFERIES)-D528-F528),NETWORKDAYS.INTL(C528,E528,1,JFERIES)-D528-F528))","v":15},"2014/08","Congés eté 2014"]
["CHEVALIER Yohan","2014-07-03","2014-07-28",0,"2014-07-31",0,"CP","Acceptée",{"$f":"IF(OR(G529=\"Convention\",H529=\"Refusée\"),0,IF(H529=\"Annulée\",-(NETWORKDAYS.INTL(C529,E529,1,JFERIES)-D529-F529),NETWORKDAYS.INTL(C529,E529,1,JFERIES)-D529-F529))","v":4},"2014/07","Congés eté 2014"]
["CHEVALIER Yohan","2014-07-03","2014-08-01",0,"2014-08-05",0,"CP","Acceptée",{"$f":"IF(OR(G530=\"Convention\",H530=\"Refusée\"),0,IF(H530=\"Annulée\",-(NETWORKDAYS.INTL(C530,E530,1,JFERIES)-D530-F530),NETWORKDAYS.INTL(C530,E530,1,JFERIES)-D530-F530))","v":3},"2014/08","Congés eté 2014"]
["CHEVALIER Yohan","2014-07-03","2014-08-28",0,"2014-08-29",0,"CP","Acceptée",{"$f":"IF(OR(G531=\"Convention\",H531=\"Refusée\"),0,IF(H531=\"Annulée\",-(NETWORKDAYS.INTL(C531,E531,1,JFERIES)-D531-F531),NETWORKDAYS.INTL(C531,E531,1,JFERIES)-D531-F531))","v":2},"2014/08","Congés eté 2014"]
["BEARZATTO Giovanni","2014-07-03","2014-07-10",0,"2014-07-10",0,"CP","Acceptée",{"$f":"IF(OR(G532=\"Convention\",H532=\"Refusée\"),0,IF(H532=\"Annulée\",-(NETWORKDAYS.INTL(C532,E532,1,JFERIES)-D532-F532),NETWORKDAYS.INTL(C532,E532,1,JFERIES)-D532-F532))","v":1},"2014/07"]
["BEARZATTO Giovanni","2014-07-03","2014-07-11",0,"2014-07-11",0,"RTT","Acceptée",{"$f":"IF(OR(G533=\"Convention\",H533=\"Refusée\"),0,IF(H533=\"Annulée\",-(NETWORKDAYS.INTL(C533,E533,1,JFERIES)-D533-F533),NETWORKDAYS.INTL(C533,E533,1,JFERIES)-D533-F533))","v":1},"2014/07"]
["HAUTEBRANC Alexis","2014-07-03","2014-07-04",0,"2014-07-04",0,"RTT","Acceptée",{"$f":"IF(OR(G534=\"Convention\",H534=\"Refusée\"),0,IF(H534=\"Annulée\",-(NETWORKDAYS.INTL(C534,E534,1,JFERIES)-D534-F534),NETWORKDAYS.INTL(C534,E534,1,JFERIES)-D534-F534))","v":1},"2014/07"]
["SOUCHET Alain","2014-07-03","2014-07-03",0,"2014-07-03",0.5,"RTT","Acceptée",{"$f":"IF(OR(G535=\"Convention\",H535=\"Refusée\"),0,IF(H535=\"Annulée\",-(NETWORKDAYS.INTL(C535,E535,1,JFERIES)-D535-F535),NETWORKDAYS.INTL(C535,E535,1,JFERIES)-D535-F535))","v":0.5},"2014/07"]
["KADEM Christophe","2014-07-07","2014-07-15",0,"2014-07-15",0,"RTT","Acceptée",{"$f":"IF(OR(G536=\"Convention\",H536=\"Refusée\"),0,IF(H536=\"Annulée\",-(NETWORKDAYS.INTL(C536,E536,1,JFERIES)-D536-F536),NETWORKDAYS.INTL(C536,E536,1,JFERIES)-D536-F536))","v":1},"2014/07"]
["KADEM Christophe","2014-07-05","2014-09-01",0,"2014-09-01",0,"RTT","Acceptée",{"$f":"IF(OR(G537=\"Convention\",H537=\"Refusée\"),0,IF(H537=\"Annulée\",-(NETWORKDAYS.INTL(C537,E537,1,JFERIES)-D537-F537),NETWORKDAYS.INTL(C537,E537,1,JFERIES)-D537-F537))","v":1},"2014/09"]
["HEMLER Christelle","2014-07-01","2014-07-09",0,"2014-07-09",0,"RTT","Acceptée",{"$f":"IF(OR(G538=\"Convention\",H538=\"Refusée\"),0,IF(H538=\"Annulée\",-(NETWORKDAYS.INTL(C538,E538,1,JFERIES)-D538-F538),NETWORKDAYS.INTL(C538,E538,1,JFERIES)-D538-F538))","v":1},"2014/07"]
["HEMLER Christelle","2014-07-02","2014-07-28",0,"2014-07-31",0,"CP","Acceptée",{"$f":"IF(OR(G539=\"Convention\",H539=\"Refusée\"),0,IF(H539=\"Annulée\",-(NETWORKDAYS.INTL(C539,E539,1,JFERIES)-D539-F539),NETWORKDAYS.INTL(C539,E539,1,JFERIES)-D539-F539))","v":4},"2014/07","Congés eté 2014"]
["HEMLER Christelle","2014-07-02","2014-08-01",0,"2014-08-08",0,"CP","Acceptée",{"$f":"IF(OR(G540=\"Convention\",H540=\"Refusée\"),0,IF(H540=\"Annulée\",-(NETWORKDAYS.INTL(C540,E540,1,JFERIES)-D540-F540),NETWORKDAYS.INTL(C540,E540,1,JFERIES)-D540-F540))","v":6},"2014/08","Congés eté 2014"]
["HEMLER Christelle","2014-07-02","2014-09-01",0,"2014-09-05",0,"CP","Acceptée",{"$f":"IF(OR(G541=\"Convention\",H541=\"Refusée\"),0,IF(H541=\"Annulée\",-(NETWORKDAYS.INTL(C541,E541,1,JFERIES)-D541-F541),NETWORKDAYS.INTL(C541,E541,1,JFERIES)-D541-F541))","v":5},"2014/09","Congés eté 2014"]
["SANTUCCI Lionel","2014-07-15","2014-08-04",0,"2014-08-25",0,"CP","Acceptée",{"$f":"IF(OR(G542=\"Convention\",H542=\"Refusée\"),0,IF(H542=\"Annulée\",-(NETWORKDAYS.INTL(C542,E542,1,JFERIES)-D542-F542),NETWORKDAYS.INTL(C542,E542,1,JFERIES)-D542-F542))","v":15},"2014/08","Congés eté 2014"]
["PONS Olivier","2014-07-15","2014-07-25",0,"2014-07-31",0,"CP","Acceptée",{"$f":"IF(OR(G543=\"Convention\",H543=\"Refusée\"),0,IF(H543=\"Annulée\",-(NETWORKDAYS.INTL(C543,E543,1,JFERIES)-D543-F543),NETWORKDAYS.INTL(C543,E543,1,JFERIES)-D543-F543))","v":5},"2014/07","Congés eté 2014"]
["PONS Olivier","2014-07-15","2014-08-01",0,"2014-08-17",0,"CP","Acceptée",{"$f":"IF(OR(G544=\"Convention\",H544=\"Refusée\"),0,IF(H544=\"Annulée\",-(NETWORKDAYS.INTL(C544,E544,1,JFERIES)-D544-F544),NETWORKDAYS.INTL(C544,E544,1,JFERIES)-D544-F544))","v":10},"2014/08","Congés eté 2014"]
["GUIOT Fabien","2014-07-15","2014-08-08",0,"2014-08-08",0,"CP","Acceptée",{"$f":"IF(OR(G545=\"Convention\",H545=\"Refusée\"),0,IF(H545=\"Annulée\",-(NETWORKDAYS.INTL(C545,E545,1,JFERIES)-D545-F545),NETWORKDAYS.INTL(C545,E545,1,JFERIES)-D545-F545))","v":1},"2014/08","Congés eté 2014"]
["TAQUET Alain","2014-07-16","2014-08-07",0,"2014-08-07",0,"RTT","Acceptée",{"$f":"IF(OR(G546=\"Convention\",H546=\"Refusée\"),0,IF(H546=\"Annulée\",-(NETWORKDAYS.INTL(C546,E546,1,JFERIES)-D546-F546),NETWORKDAYS.INTL(C546,E546,1,JFERIES)-D546-F546))","v":1},"2014/08"]
["TAQUET Alain","2014-07-16","2014-09-01",0,"2014-09-01",0,"CP","Acceptée",{"$f":"IF(OR(G547=\"Convention\",H547=\"Refusée\"),0,IF(H547=\"Annulée\",-(NETWORKDAYS.INTL(C547,E547,1,JFERIES)-D547-F547),NETWORKDAYS.INTL(C547,E547,1,JFERIES)-D547-F547))","v":1},"2014/09","Congés eté 2014"]
["DEREPPE Bruno","2014-07-17","2014-07-25",0,"2014-07-25",0,"RTT","Acceptée",{"$f":"IF(OR(G548=\"Convention\",H548=\"Refusée\"),0,IF(H548=\"Annulée\",-(NETWORKDAYS.INTL(C548,E548,1,JFERIES)-D548-F548),NETWORKDAYS.INTL(C548,E548,1,JFERIES)-D548-F548))","v":1},"2014/07"]
["PLONQUET Christian","2014-07-22","2014-08-04",0,"2014-08-29",0,"CP","Acceptée",{"$f":"IF(OR(G549=\"Convention\",H549=\"Refusée\"),0,IF(H549=\"Annulée\",-(NETWORKDAYS.INTL(C549,E549,1,JFERIES)-D549-F549),NETWORKDAYS.INTL(C549,E549,1,JFERIES)-D549-F549))","v":19},"2014/08","Congés eté 2014"]
["HEMLER Christelle","2014-07-22","2014-07-25",0,"2014-07-25",0,"RTT","Acceptée",{"$f":"IF(OR(G550=\"Convention\",H550=\"Refusée\"),0,IF(H550=\"Annulée\",-(NETWORKDAYS.INTL(C550,E550,1,JFERIES)-D550-F550),NETWORKDAYS.INTL(C550,E550,1,JFERIES)-D550-F550))","v":1},"2014/07"]
["MARAIS Bernard","2014-07-22","2014-08-27",0,"2014-08-29",0,"CP","Acceptée",{"$f":"IF(OR(G551=\"Convention\",H551=\"Refusée\"),0,IF(H551=\"Annulée\",-(NETWORKDAYS.INTL(C551,E551,1,JFERIES)-D551-F551),NETWORKDAYS.INTL(C551,E551,1,JFERIES)-D551-F551))","v":3},"2014/08","Congés eté 2014"]
["GUERIN Viviane","2014-03-03","2014-07-11",0,"2014-07-11",0.5,"RTD Recup","Acceptée",{"$f":"IF(OR(G552=\"Convention\",H552=\"Refusée\"),0,IF(H552=\"Annulée\",-(NETWORKDAYS.INTL(C552,E552,1,JFERIES)-D552-F552),NETWORKDAYS.INTL(C552,E552,1,JFERIES)-D552-F552))","v":0.5},"2014/07","ARTD 2014"]
["GUERIN Viviane","2014-07-31","2014-11-10",0,"2014-11-10",0,"RTT","Acceptée",{"$f":"IF(OR(G553=\"Convention\",H553=\"Refusée\"),0,IF(H553=\"Annulée\",-(NETWORKDAYS.INTL(C553,E553,1,JFERIES)-D553-F553),NETWORKDAYS.INTL(C553,E553,1,JFERIES)-D553-F553))","v":1},"2014/11"]
["GUERIN Viviane","2014-07-31","2014-11-21",0,"2014-11-21",0,"RTD Recup","Acceptée",{"$f":"IF(OR(G554=\"Convention\",H554=\"Refusée\"),0,IF(H554=\"Annulée\",-(NETWORKDAYS.INTL(C554,E554,1,JFERIES)-D554-F554),NETWORKDAYS.INTL(C554,E554,1,JFERIES)-D554-F554))","v":1},"2014/11","ARTD 2014"]
["GUERIN Viviane","2014-07-31","2014-11-24",0,"2014-11-24",0,"RTT","Acceptée",{"$f":"IF(OR(G555=\"Convention\",H555=\"Refusée\"),0,IF(H555=\"Annulée\",-(NETWORKDAYS.INTL(C555,E555,1,JFERIES)-D555-F555),NETWORKDAYS.INTL(C555,E555,1,JFERIES)-D555-F555))","v":1},"2014/11"]
["GUERIN Viviane","2014-07-31","2014-12-24",0,"2014-12-24",0,"RTD Recup","Acceptée",{"$f":"IF(OR(G556=\"Convention\",H556=\"Refusée\"),0,IF(H556=\"Annulée\",-(NETWORKDAYS.INTL(C556,E556,1,JFERIES)-D556-F556),NETWORKDAYS.INTL(C556,E556,1,JFERIES)-D556-F556))","v":1},"2014/12","ARTD 2014"]
["GUERIN Viviane","2014-07-31","2014-12-26",0,"2014-12-26",0,"RTT","Acceptée",{"$f":"IF(OR(G557=\"Convention\",H557=\"Refusée\"),0,IF(H557=\"Annulée\",-(NETWORKDAYS.INTL(C557,E557,1,JFERIES)-D557-F557),NETWORKDAYS.INTL(C557,E557,1,JFERIES)-D557-F557))","v":1},"2014/12"]
["GUERIN Viviane","2014-07-31","2014-12-22",0,"2014-12-23",0,"CP","Refusée",{"$f":"IF(OR(G558=\"Convention\",H558=\"Refusée\"),0,IF(H558=\"Annulée\",-(NETWORKDAYS.INTL(C558,E558,1,JFERIES)-D558-F558),NETWORKDAYS.INTL(C558,E558,1,JFERIES)-D558-F558))","v":0},"2014/12","trop de jours demandés sur période rouge"]
["HAUTEBRANC Alexis","2014-08-11","2014-10-10",0,"2014-10-10",0,"RTT","Acceptée",{"$f":"IF(OR(G559=\"Convention\",H559=\"Refusée\"),0,IF(H559=\"Annulée\",-(NETWORKDAYS.INTL(C559,E559,1,JFERIES)-D559-F559),NETWORKDAYS.INTL(C559,E559,1,JFERIES)-D559-F559))","v":1},"2014/10"]
["HAUTEBRANC Alexis","2014-08-11","2014-10-13",0,"2014-10-13",0,"CP","Acceptée",{"$f":"IF(OR(G560=\"Convention\",H560=\"Refusée\"),0,IF(H560=\"Annulée\",-(NETWORKDAYS.INTL(C560,E560,1,JFERIES)-D560-F560),NETWORKDAYS.INTL(C560,E560,1,JFERIES)-D560-F560))","v":1},"2014/10"]
["DREVON Alain","2014-08-12","2014-08-25",0,"2014-08-27",0.5,"CP","Annulée",{"$f":"IF(OR(G561=\"Convention\",H561=\"Refusée\"),0,IF(H561=\"Annulée\",-(NETWORKDAYS.INTL(C561,E561,1,JFERIES)-D561-F561),NETWORKDAYS.INTL(C561,E561,1,JFERIES)-D561-F561))","v":-2.5},"2014/08","Congés eté 2014"]
["LAZZARO Fabien","2014-08-19","2014-09-12",0,"2014-09-12",0,"RTT","Acceptée",{"$f":"IF(OR(G562=\"Convention\",H562=\"Refusée\"),0,IF(H562=\"Annulée\",-(NETWORKDAYS.INTL(C562,E562,1,JFERIES)-D562-F562),NETWORKDAYS.INTL(C562,E562,1,JFERIES)-D562-F562))","v":1},"2014/09"]
["LAZZARO Fabien","2014-08-19","2014-09-15",0,"2014-09-15",0,"RTT","Acceptée",{"$f":"IF(OR(G563=\"Convention\",H563=\"Refusée\"),0,IF(H563=\"Annulée\",-(NETWORKDAYS.INTL(C563,E563,1,JFERIES)-D563-F563),NETWORKDAYS.INTL(C563,E563,1,JFERIES)-D563-F563))","v":1},"2014/09"]
["SANTUCCI Lionel","2014-08-26","2014-08-27",0,"2014-08-27",0.5,"RTT","Acceptée",{"$f":"IF(OR(G564=\"Convention\",H564=\"Refusée\"),0,IF(H564=\"Annulée\",-(NETWORKDAYS.INTL(C564,E564,1,JFERIES)-D564-F564),NETWORKDAYS.INTL(C564,E564,1,JFERIES)-D564-F564))","v":0.5},"2014/08"]
["SANTUCCI Lionel","2014-09-01","2014-09-04",0,"2014-09-04",0.5,"RTT","Acceptée",{"$f":"IF(OR(G565=\"Convention\",H565=\"Refusée\"),0,IF(H565=\"Annulée\",-(NETWORKDAYS.INTL(C565,E565,1,JFERIES)-D565-F565),NETWORKDAYS.INTL(C565,E565,1,JFERIES)-D565-F565))","v":0.5},"2014/09"]
["SANTUCCI Lionel","2014-09-09","2014-09-29",0,"2014-09-29",0,"CP","Acceptée",{"$f":"IF(OR(G566=\"Convention\",H566=\"Refusée\"),0,IF(H566=\"Annulée\",-(NETWORKDAYS.INTL(C566,E566,1,JFERIES)-D566-F566),NETWORKDAYS.INTL(C566,E566,1,JFERIES)-D566-F566))","v":1},"2014/09"]
["LOYER Michel","2014-09-04","2014-09-24",0,"2014-09-24",0,"CP","Acceptée",{"$f":"IF(OR(G567=\"Convention\",H567=\"Refusée\"),0,IF(H567=\"Annulée\",-(NETWORKDAYS.INTL(C567,E567,1,JFERIES)-D567-F567),NETWORKDAYS.INTL(C567,E567,1,JFERIES)-D567-F567))","v":1},"2014/09"]
["LOYER Michel","2014-09-04","2014-09-25",0,"2014-09-25",0,"RTT","Acceptée",{"$f":"IF(OR(G568=\"Convention\",H568=\"Refusée\"),0,IF(H568=\"Annulée\",-(NETWORKDAYS.INTL(C568,E568,1,JFERIES)-D568-F568),NETWORKDAYS.INTL(C568,E568,1,JFERIES)-D568-F568))","v":1},"2014/09"]
["LOYER Michel","2014-09-04","2014-10-20",0,"2014-10-20",0,"CP","Acceptée",{"$f":"IF(OR(G569=\"Convention\",H569=\"Refusée\"),0,IF(H569=\"Annulée\",-(NETWORKDAYS.INTL(C569,E569,1,JFERIES)-D569-F569),NETWORKDAYS.INTL(C569,E569,1,JFERIES)-D569-F569))","v":1},"2014/10"]
["LOYER Michel","2014-09-04","2014-10-21",0,"2014-10-21",0,"RTT","Acceptée",{"$f":"IF(OR(G570=\"Convention\",H570=\"Refusée\"),0,IF(H570=\"Annulée\",-(NETWORKDAYS.INTL(C570,E570,1,JFERIES)-D570-F570),NETWORKDAYS.INTL(C570,E570,1,JFERIES)-D570-F570))","v":1},"2014/10"]
["POMMERELL Patrick","2014-09-04","2014-09-01",0.5,"2014-09-01",0,"RTT","Acceptée",{"$f":"IF(OR(G571=\"Convention\",H571=\"Refusée\"),0,IF(H571=\"Annulée\",-(NETWORKDAYS.INTL(C571,E571,1,JFERIES)-D571-F571),NETWORKDAYS.INTL(C571,E571,1,JFERIES)-D571-F571))","v":0.5},"2014/09"]
["POMMERELL Patrick","2014-09-04","2014-09-02",0.5,"2014-09-02",0,"RTT","Acceptée",{"$f":"IF(OR(G572=\"Convention\",H572=\"Refusée\"),0,IF(H572=\"Annulée\",-(NETWORKDAYS.INTL(C572,E572,1,JFERIES)-D572-F572),NETWORKDAYS.INTL(C572,E572,1,JFERIES)-D572-F572))","v":0.5},"2014/09"]
["POMMERELL Patrick","2014-09-04","2014-09-09",0.5,"2014-09-09",0,"RTT","Acceptée",{"$f":"IF(OR(G573=\"Convention\",H573=\"Refusée\"),0,IF(H573=\"Annulée\",-(NETWORKDAYS.INTL(C573,E573,1,JFERIES)-D573-F573),NETWORKDAYS.INTL(C573,E573,1,JFERIES)-D573-F573))","v":0.5},"2014/09"]
["HEMLER Christelle","2014-09-10","2014-09-17",0,"2014-09-17",0,"RTT","Acceptée",{"$f":"IF(OR(G574=\"Convention\",H574=\"Refusée\"),0,IF(H574=\"Annulée\",-(NETWORKDAYS.INTL(C574,E574,1,JFERIES)-D574-F574),NETWORKDAYS.INTL(C574,E574,1,JFERIES)-D574-F574))","v":1},"2014/09"]
["SIODMAK Eric","2014-09-11","2014-09-16",0,"2014-09-16",0,"RTT","Acceptée",{"$f":"IF(OR(G575=\"Convention\",H575=\"Refusée\"),0,IF(H575=\"Annulée\",-(NETWORKDAYS.INTL(C575,E575,1,JFERIES)-D575-F575),NETWORKDAYS.INTL(C575,E575,1,JFERIES)-D575-F575))","v":1},"2014/09"]
["SIODMAK Eric","2014-09-11","2014-09-22",0,"2014-09-22",0,"RTT","Acceptée",{"$f":"IF(OR(G576=\"Convention\",H576=\"Refusée\"),0,IF(H576=\"Annulée\",-(NETWORKDAYS.INTL(C576,E576,1,JFERIES)-D576-F576),NETWORKDAYS.INTL(C576,E576,1,JFERIES)-D576-F576))","v":1},"2014/09"]
["MARZOUK Sami","2014-05-05","2014-08-01",0,"2014-08-31",0,"CP","Acceptée",{"$f":"IF(OR(G577=\"Convention\",H577=\"Refusée\"),0,IF(H577=\"Annulée\",-(NETWORKDAYS.INTL(C577,E577,1,JFERIES)-D577-F577),NETWORKDAYS.INTL(C577,E577,1,JFERIES)-D577-F577))","v":20},"2014/08","Congés eté 2014"]
["LEDANT Charles","2014-09-16","2014-09-29",0,"2014-09-29",0,"RTT","Acceptée",{"$f":"IF(OR(G578=\"Convention\",H578=\"Refusée\"),0,IF(H578=\"Annulée\",-(NETWORKDAYS.INTL(C578,E578,1,JFERIES)-D578-F578),NETWORKDAYS.INTL(C578,E578,1,JFERIES)-D578-F578))","v":1},"2014/09"]
["LEDANT Charles","2014-09-16","2014-10-06",0,"2014-10-06",0,"RTT","Acceptée",{"$f":"IF(OR(G579=\"Convention\",H579=\"Refusée\"),0,IF(H579=\"Annulée\",-(NETWORKDAYS.INTL(C579,E579,1,JFERIES)-D579-F579),NETWORKDAYS.INTL(C579,E579,1,JFERIES)-D579-F579))","v":1},"2014/10"]
["LOCATELLI Bruno","2014-09-11","2014-09-29",0,"2014-09-29",0,"CP","Acceptée",{"$f":"IF(OR(G580=\"Convention\",H580=\"Refusée\"),0,IF(H580=\"Annulée\",-(NETWORKDAYS.INTL(C580,E580,1,JFERIES)-D580-F580),NETWORKDAYS.INTL(C580,E580,1,JFERIES)-D580-F580))","v":1},"2014/09","ACCORD EXCEPTIONNEL Congés eté 2014"]
["DREZET Olivier","2014-09-19","2014-10-20",0,"2014-10-20",0,"RTT","Acceptée",{"$f":"IF(OR(G581=\"Convention\",H581=\"Refusée\"),0,IF(H581=\"Annulée\",-(NETWORKDAYS.INTL(C581,E581,1,JFERIES)-D581-F581),NETWORKDAYS.INTL(C581,E581,1,JFERIES)-D581-F581))","v":1},"2014/10"]
["COUTANT Jean Paul","2014-09-19","2014-10-20",0,"2014-10-20",0,"RTT","Acceptée",{"$f":"IF(OR(G582=\"Convention\",H582=\"Refusée\"),0,IF(H582=\"Annulée\",-(NETWORKDAYS.INTL(C582,E582,1,JFERIES)-D582-F582),NETWORKDAYS.INTL(C582,E582,1,JFERIES)-D582-F582))","v":1},"2014/10"]
["PLONQUET Christian","2014-10-23","2014-10-22",0,"2014-10-22",0,"CP","Acceptée",{"$f":"IF(OR(G583=\"Convention\",H583=\"Refusée\"),0,IF(H583=\"Annulée\",-(NETWORKDAYS.INTL(C583,E583,1,JFERIES)-D583-F583),NETWORKDAYS.INTL(C583,E583,1,JFERIES)-D583-F583))","v":1},"2014/10"]
["BERTHE Magali","2014-09-23","2014-11-07",0,"2014-11-07",0.5,"CP","Acceptée",{"$f":"IF(OR(G584=\"Convention\",H584=\"Refusée\"),0,IF(H584=\"Annulée\",-(NETWORKDAYS.INTL(C584,E584,1,JFERIES)-D584-F584),NETWORKDAYS.INTL(C584,E584,1,JFERIES)-D584-F584))","v":0.5},"2014/11"]
["MARAIS Bernard","2014-09-25","2014-12-26",0,"2014-12-26",0,"CP","Acceptée",{"$f":"IF(OR(G585=\"Convention\",H585=\"Refusée\"),0,IF(H585=\"Annulée\",-(NETWORKDAYS.INTL(C585,E585,1,JFERIES)-D585-F585),NETWORKDAYS.INTL(C585,E585,1,JFERIES)-D585-F585))","v":1},"2014/12"]
["MARAIS Bernard","2014-09-25","2015-01-02",0,"2015-01-02",0,"CP","Acceptée",{"$f":"IF(OR(G586=\"Convention\",H586=\"Refusée\"),0,IF(H586=\"Annulée\",-(NETWORKDAYS.INTL(C586,E586,1,JFERIES)-D586-F586),NETWORKDAYS.INTL(C586,E586,1,JFERIES)-D586-F586))","v":1},"2015/01"]
["ROBIN Kevin","2014-09-25","2014-11-10",0,"2014-11-10",0,"CP","Acceptée",{"$f":"IF(OR(G587=\"Convention\",H587=\"Refusée\"),0,IF(H587=\"Annulée\",-(NETWORKDAYS.INTL(C587,E587,1,JFERIES)-D587-F587),NETWORKDAYS.INTL(C587,E587,1,JFERIES)-D587-F587))","v":1},"2014/11"]
["TAQUET Alain","2014-09-29","2014-09-30",0,"2014-09-30",0,"RTT","Acceptée",{"$f":"IF(OR(G588=\"Convention\",H588=\"Refusée\"),0,IF(H588=\"Annulée\",-(NETWORKDAYS.INTL(C588,E588,1,JFERIES)-D588-F588),NETWORKDAYS.INTL(C588,E588,1,JFERIES)-D588-F588))","v":1},"2014/09"]
["SOUCHET Alain","2014-10-01","2014-11-10",0,"2014-11-10",0,"RTT","Acceptée",{"$f":"IF(OR(G589=\"Convention\",H589=\"Refusée\"),0,IF(H589=\"Annulée\",-(NETWORKDAYS.INTL(C589,E589,1,JFERIES)-D589-F589),NETWORKDAYS.INTL(C589,E589,1,JFERIES)-D589-F589))","v":1},"2014/11"]
["SOUCHET Alain","2014-10-01","2014-12-26",0,"2014-12-26",0,"RTT","Acceptée",{"$f":"IF(OR(G590=\"Convention\",H590=\"Refusée\"),0,IF(H590=\"Annulée\",-(NETWORKDAYS.INTL(C590,E590,1,JFERIES)-D590-F590),NETWORKDAYS.INTL(C590,E590,1,JFERIES)-D590-F590))","v":1},"2014/12"]
["KADEM Christophe","2014-10-01","2014-11-10",0,"2014-11-10",0,"RTT","Acceptée",{"$f":"IF(OR(G591=\"Convention\",H591=\"Refusée\"),0,IF(H591=\"Annulée\",-(NETWORKDAYS.INTL(C591,E591,1,JFERIES)-D591-F591),NETWORKDAYS.INTL(C591,E591,1,JFERIES)-D591-F591))","v":1},"2014/11"]
["KADEM Christophe","2014-10-01","2014-12-26",0,"2014-12-26",0,"RTT","Acceptée",{"$f":"IF(OR(G592=\"Convention\",H592=\"Refusée\"),0,IF(H592=\"Annulée\",-(NETWORKDAYS.INTL(C592,E592,1,JFERIES)-D592-F592),NETWORKDAYS.INTL(C592,E592,1,JFERIES)-D592-F592))","v":1},"2014/12"]
["LAZZARO Fabien","2014-10-01","2014-12-26",0,"2014-12-26",0,"RTT","Acceptée",{"$f":"IF(OR(G593=\"Convention\",H593=\"Refusée\"),0,IF(H593=\"Annulée\",-(NETWORKDAYS.INTL(C593,E593,1,JFERIES)-D593-F593),NETWORKDAYS.INTL(C593,E593,1,JFERIES)-D593-F593))","v":1},"2014/12"]
["SIODMAK Eric","2014-10-05","2014-10-06",0,"2014-10-06",0,"RTT","Acceptée",{"$f":"IF(OR(G594=\"Convention\",H594=\"Refusée\"),0,IF(H594=\"Annulée\",-(NETWORKDAYS.INTL(C594,E594,1,JFERIES)-D594-F594),NETWORKDAYS.INTL(C594,E594,1,JFERIES)-D594-F594))","v":1},"2014/10"]
["DREZET Olivier","2014-10-02","2014-11-03",0,"2014-11-03",0,"RTT","Acceptée",{"$f":"IF(OR(G595=\"Convention\",H595=\"Refusée\"),0,IF(H595=\"Annulée\",-(NETWORKDAYS.INTL(C595,E595,1,JFERIES)-D595-F595),NETWORKDAYS.INTL(C595,E595,1,JFERIES)-D595-F595))","v":1},"2014/11"]
["PLONQUET Christian","2014-10-06","2014-10-27",0,"2014-10-27",0,"CP","Acceptée",{"$f":"IF(OR(G596=\"Convention\",H596=\"Refusée\"),0,IF(H596=\"Annulée\",-(NETWORKDAYS.INTL(C596,E596,1,JFERIES)-D596-F596),NETWORKDAYS.INTL(C596,E596,1,JFERIES)-D596-F596))","v":1},"2014/10"]
["DREZET Olivier","2014-10-06","2014-10-31",0,"2014-10-31",0,"RTT","Acceptée",{"$f":"IF(OR(G597=\"Convention\",H597=\"Refusée\"),0,IF(H597=\"Annulée\",-(NETWORKDAYS.INTL(C597,E597,1,JFERIES)-D597-F597),NETWORKDAYS.INTL(C597,E597,1,JFERIES)-D597-F597))","v":1},"2014/10"]
["TAQUET Alain","2014-10-07","2014-10-23",0,"2014-10-23",0,"RTT","Acceptée",{"$f":"IF(OR(G598=\"Convention\",H598=\"Refusée\"),0,IF(H598=\"Annulée\",-(NETWORKDAYS.INTL(C598,E598,1,JFERIES)-D598-F598),NETWORKDAYS.INTL(C598,E598,1,JFERIES)-D598-F598))","v":1},"2014/10"]
["HEMLER Christelle","2014-10-08","2014-10-15",0,"2014-10-15",0,"RTT","Acceptée",{"$f":"IF(OR(G599=\"Convention\",H599=\"Refusée\"),0,IF(H599=\"Annulée\",-(NETWORKDAYS.INTL(C599,E599,1,JFERIES)-D599-F599),NETWORKDAYS.INTL(C599,E599,1,JFERIES)-D599-F599))","v":1},"2014/10"]
["GUINOT Nathalie","2014-10-08","2014-10-08",0,"2014-10-08",0.5,"RTT","Acceptée",{"$f":"IF(OR(G600=\"Convention\",H600=\"Refusée\"),0,IF(H600=\"Annulée\",-(NETWORKDAYS.INTL(C600,E600,1,JFERIES)-D600-F600),NETWORKDAYS.INTL(C600,E600,1,JFERIES)-D600-F600))","v":0.5},"2014/10"]
["GUINOT Nathalie","2014-10-13","2014-10-30",0,"2014-10-31",0,"RTT","Acceptée",{"$f":"IF(OR(G601=\"Convention\",H601=\"Refusée\"),0,IF(H601=\"Annulée\",-(NETWORKDAYS.INTL(C601,E601,1,JFERIES)-D601-F601),NETWORKDAYS.INTL(C601,E601,1,JFERIES)-D601-F601))","v":2},"2014/10"]
["GIRAUDON Alain","2014-10-14","2014-10-17",0,"2014-10-17",0.5,"RTT","Acceptée",{"$f":"IF(OR(G602=\"Convention\",H602=\"Refusée\"),0,IF(H602=\"Annulée\",-(NETWORKDAYS.INTL(C602,E602,1,JFERIES)-D602-F602),NETWORKDAYS.INTL(C602,E602,1,JFERIES)-D602-F602))","v":0.5},"2014/10"]
["MARAIS Bernard","2014-10-14","2015-02-09",0,"2015-02-13",0,"CP","Acceptée",{"$f":"IF(OR(G603=\"Convention\",H603=\"Refusée\"),0,IF(H603=\"Annulée\",-(NETWORKDAYS.INTL(C603,E603,1,JFERIES)-D603-F603),NETWORKDAYS.INTL(C603,E603,1,JFERIES)-D603-F603))","v":5},"2015/02"]
["LEDANT Charles","2014-10-17","2014-11-10",0,"2014-11-10",0,"CP","Acceptée",{"$f":"IF(OR(G604=\"Convention\",H604=\"Refusée\"),0,IF(H604=\"Annulée\",-(NETWORKDAYS.INTL(C604,E604,1,JFERIES)-D604-F604),NETWORKDAYS.INTL(C604,E604,1,JFERIES)-D604-F604))","v":1},"2014/11"]
["BEARZATTO Giovanni","2014-10-21","2014-11-10",0,"2014-11-10",0,"RTT","Acceptée",{"$f":"IF(OR(G605=\"Convention\",H605=\"Refusée\"),0,IF(H605=\"Annulée\",-(NETWORKDAYS.INTL(C605,E605,1,JFERIES)-D605-F605),NETWORKDAYS.INTL(C605,E605,1,JFERIES)-D605-F605))","v":1},"2014/11"]
["GUIOT Fabien","2014-10-20","2014-10-24",0,"2014-10-24",0,"RTT","Acceptée",{"$f":"IF(OR(G606=\"Convention\",H606=\"Refusée\"),0,IF(H606=\"Annulée\",-(NETWORKDAYS.INTL(C606,E606,1,JFERIES)-D606-F606),NETWORKDAYS.INTL(C606,E606,1,JFERIES)-D606-F606))","v":1},"2014/10"]
["GUIOT Fabien","2014-10-20","2014-11-10",0,"2014-11-10",0,"RTT","Acceptée",{"$f":"IF(OR(G607=\"Convention\",H607=\"Refusée\"),0,IF(H607=\"Annulée\",-(NETWORKDAYS.INTL(C607,E607,1,JFERIES)-D607-F607),NETWORKDAYS.INTL(C607,E607,1,JFERIES)-D607-F607))","v":1},"2014/11"]
["LAZZARO Fabien","2014-10-22","2014-11-03",0,"2014-11-03",0,"RTD Recup","Acceptée",{"$f":"IF(OR(G608=\"Convention\",H608=\"Refusée\"),0,IF(H608=\"Annulée\",-(NETWORKDAYS.INTL(C608,E608,1,JFERIES)-D608-F608),NETWORKDAYS.INTL(C608,E608,1,JFERIES)-D608-F608))","v":1},"2014/11","ARTD 2014"]
["SANTUCCI Lionel","2014-10-23","2014-10-24",0,"2014-10-24",0,"RTT","Acceptée",{"$f":"IF(OR(G609=\"Convention\",H609=\"Refusée\"),0,IF(H609=\"Annulée\",-(NETWORKDAYS.INTL(C609,E609,1,JFERIES)-D609-F609),NETWORKDAYS.INTL(C609,E609,1,JFERIES)-D609-F609))","v":1},"2014/10","Demande de CP acceptée en RTT"]
["GUINOT Nathalie","2014-10-14","2014-02-23",0,"2014-02-27",0,"CP","Acceptée",{"$f":"IF(OR(G610=\"Convention\",H610=\"Refusée\"),0,IF(H610=\"Annulée\",-(NETWORKDAYS.INTL(C610,E610,1,JFERIES)-D610-F610),NETWORKDAYS.INTL(C610,E610,1,JFERIES)-D610-F610))","v":4},"2014/02"]
["BERTHE Magali","2014-10-16","2014-11-10",0,"2014-11-10",0,"CP","Acceptée",{"$f":"IF(OR(G611=\"Convention\",H611=\"Refusée\"),0,IF(H611=\"Annulée\",-(NETWORKDAYS.INTL(C611,E611,1,JFERIES)-D611-F611),NETWORKDAYS.INTL(C611,E611,1,JFERIES)-D611-F611))","v":1},"2014/11"]
["MINAKIAN Mathilde","2014-10-27","2014-11-10",0,"2014-11-10",0,"CP","Acceptée",{"$f":"IF(OR(G612=\"Convention\",H612=\"Refusée\"),0,IF(H612=\"Annulée\",-(NETWORKDAYS.INTL(C612,E612,1,JFERIES)-D612-F612),NETWORKDAYS.INTL(C612,E612,1,JFERIES)-D612-F612))","v":1},"2014/11"]
["COUTANT Jean Paul","2014-10-27","2014-11-10",0,"2014-11-10",0,"RTT","Acceptée",{"$f":"IF(OR(G613=\"Convention\",H613=\"Refusée\"),0,IF(H613=\"Annulée\",-(NETWORKDAYS.INTL(C613,E613,1,JFERIES)-D613-F613),NETWORKDAYS.INTL(C613,E613,1,JFERIES)-D613-F613))","v":1},"2014/11"]
["DEREPPE Bruno","2014-10-30","2014-11-10",0,"2014-11-10",0,"RTT","Acceptée",{"$f":"IF(OR(G614=\"Convention\",H614=\"Refusée\"),0,IF(H614=\"Annulée\",-(NETWORKDAYS.INTL(C614,E614,1,JFERIES)-D614-F614),NETWORKDAYS.INTL(C614,E614,1,JFERIES)-D614-F614))","v":1},"2014/11"]
["KADEM Christophe","2014-11-03","2014-11-17",0,"2014-11-17",0,"RTT","Acceptée",{"$f":"IF(OR(G615=\"Convention\",H615=\"Refusée\"),0,IF(H615=\"Annulée\",-(NETWORKDAYS.INTL(C615,E615,1,JFERIES)-D615-F615),NETWORKDAYS.INTL(C615,E615,1,JFERIES)-D615-F615))","v":1},"2014/11"]
["KADEM Christophe","2014-11-03","2014-11-25",0,"2014-11-25",0,"RTT","Acceptée",{"$f":"IF(OR(G616=\"Convention\",H616=\"Refusée\"),0,IF(H616=\"Annulée\",-(NETWORKDAYS.INTL(C616,E616,1,JFERIES)-D616-F616),NETWORKDAYS.INTL(C616,E616,1,JFERIES)-D616-F616))","v":1},"2014/11"]
["KADEM Christophe","2014-11-03","2014-12-10",0,"2014-12-10",0,"CP","Acceptée",{"$f":"IF(OR(G617=\"Convention\",H617=\"Refusée\"),0,IF(H617=\"Annulée\",-(NETWORKDAYS.INTL(C617,E617,1,JFERIES)-D617-F617),NETWORKDAYS.INTL(C617,E617,1,JFERIES)-D617-F617))","v":1},"2014/12","RTT transformé en CP  "]
["MARZOUK Sami","2014-11-04","2014-11-10",0,"2014-11-10",0,"RTT","Acceptée",{"$f":"IF(OR(G618=\"Convention\",H618=\"Refusée\"),0,IF(H618=\"Annulée\",-(NETWORKDAYS.INTL(C618,E618,1,JFERIES)-D618-F618),NETWORKDAYS.INTL(C618,E618,1,JFERIES)-D618-F618))","v":1},"2014/11"]
["MARZOUK Sami","2014-11-04","2014-12-24",0,"2014-12-26",0,"RTT","Acceptée",{"$f":"IF(OR(G619=\"Convention\",H619=\"Refusée\"),0,IF(H619=\"Annulée\",-(NETWORKDAYS.INTL(C619,E619,1,JFERIES)-D619-F619),NETWORKDAYS.INTL(C619,E619,1,JFERIES)-D619-F619))","v":2},"2014/12"]
["PLONQUET Christian","2014-11-12","2014-10-22",0,"2014-10-22",0,"CP","Annulée",{"$f":"IF(OR(G620=\"Convention\",H620=\"Refusée\"),0,IF(H620=\"Annulée\",-(NETWORKDAYS.INTL(C620,E620,1,JFERIES)-D620-F620),NETWORKDAYS.INTL(C620,E620,1,JFERIES)-D620-F620))","v":-1},"2014/10"]
["PLONQUET Christian","2014-11-12","2014-10-27",0,"2014-10-27",0,"CP","Annulée",{"$f":"IF(OR(G621=\"Convention\",H621=\"Refusée\"),0,IF(H621=\"Annulée\",-(NETWORKDAYS.INTL(C621,E621,1,JFERIES)-D621-F621),NETWORKDAYS.INTL(C621,E621,1,JFERIES)-D621-F621))","v":-1},"2014/10"]
["PLONQUET Christian","2014-11-12","2014-11-18",0,"2014-11-19",0,"CP","Acceptée",{"$f":"IF(OR(G622=\"Convention\",H622=\"Refusée\"),0,IF(H622=\"Annulée\",-(NETWORKDAYS.INTL(C622,E622,1,JFERIES)-D622-F622),NETWORKDAYS.INTL(C622,E622,1,JFERIES)-D622-F622))","v":2},"2014/11"]
["LOCATELLI Bruno","2014-11-12","2014-12-26",0,"2014-12-26",0,"RTT","Acceptée",{"$f":"IF(OR(G623=\"Convention\",H623=\"Refusée\"),0,IF(H623=\"Annulée\",-(NETWORKDAYS.INTL(C623,E623,1,JFERIES)-D623-F623),NETWORKDAYS.INTL(C623,E623,1,JFERIES)-D623-F623))","v":1},"2014/12"]
["DREZET Olivier","2014-11-13","2014-12-24",0,"2014-12-26",0,"RTT","Acceptée",{"$f":"IF(OR(G624=\"Convention\",H624=\"Refusée\"),0,IF(H624=\"Annulée\",-(NETWORKDAYS.INTL(C624,E624,1,JFERIES)-D624-F624),NETWORKDAYS.INTL(C624,E624,1,JFERIES)-D624-F624))","v":2},"2014/12"]
["DREZET Olivier","2014-11-13","2014-12-31",0,"2014-12-31",0,"CP","Acceptée",{"$f":"IF(OR(G625=\"Convention\",H625=\"Refusée\"),0,IF(H625=\"Annulée\",-(NETWORKDAYS.INTL(C625,E625,1,JFERIES)-D625-F625),NETWORKDAYS.INTL(C625,E625,1,JFERIES)-D625-F625))","v":1},"2014/12"]
["DREZET Olivier","2014-11-17","2014-11-20",0,"2014-11-20",0,"CP","Acceptée",{"$f":"IF(OR(G626=\"Convention\",H626=\"Refusée\"),0,IF(H626=\"Annulée\",-(NETWORKDAYS.INTL(C626,E626,1,JFERIES)-D626-F626),NETWORKDAYS.INTL(C626,E626,1,JFERIES)-D626-F626))","v":1},"2014/11"]
["PONS Olivier","2014-11-17","2015-02-23",0,"2015-03-03",0,"CP","Acceptée",{"$f":"IF(OR(G627=\"Convention\",H627=\"Refusée\"),0,IF(H627=\"Annulée\",-(NETWORKDAYS.INTL(C627,E627,1,JFERIES)-D627-F627),NETWORKDAYS.INTL(C627,E627,1,JFERIES)-D627-F627))","v":7},"2015/03"]
["GIRAUDON Alain","2014-11-18","2014-12-12",0,"2014-12-12",0.5,"RTT","Acceptée",{"$f":"IF(OR(G628=\"Convention\",H628=\"Refusée\"),0,IF(H628=\"Annulée\",-(NETWORKDAYS.INTL(C628,E628,1,JFERIES)-D628-F628),NETWORKDAYS.INTL(C628,E628,1,JFERIES)-D628-F628))","v":0.5},"2014/12"]
["GIRAUDON Alain","2014-11-18","2014-12-26",0,"2014-12-26",0,"RTT","Acceptée",{"$f":"IF(OR(G629=\"Convention\",H629=\"Refusée\"),0,IF(H629=\"Annulée\",-(NETWORKDAYS.INTL(C629,E629,1,JFERIES)-D629-F629),NETWORKDAYS.INTL(C629,E629,1,JFERIES)-D629-F629))","v":1},"2014/12"]
["LOCATELLI Bruno","2014-11-18","2014-12-02",0,"2014-12-02",0,"RTT","Acceptée",{"$f":"IF(OR(G630=\"Convention\",H630=\"Refusée\"),0,IF(H630=\"Annulée\",-(NETWORKDAYS.INTL(C630,E630,1,JFERIES)-D630-F630),NETWORKDAYS.INTL(C630,E630,1,JFERIES)-D630-F630))","v":1},"2014/12"]
["HAUTEBRANC Alexis","2014-11-20","2014-12-19",0,"2014-12-19",0.5,"CP","Acceptée",{"$f":"IF(OR(G631=\"Convention\",H631=\"Refusée\"),0,IF(H631=\"Annulée\",-(NETWORKDAYS.INTL(C631,E631,1,JFERIES)-D631-F631),NETWORKDAYS.INTL(C631,E631,1,JFERIES)-D631-F631))","v":0.5},"2014/12"]
["HAUTEBRANC Alexis","2014-11-20","2014-12-19",0,"2014-12-19",0,"RTT","Acceptée",{"$f":"IF(OR(G632=\"Convention\",H632=\"Refusée\"),0,IF(H632=\"Annulée\",-(NETWORKDAYS.INTL(C632,E632,1,JFERIES)-D632-F632),NETWORKDAYS.INTL(C632,E632,1,JFERIES)-D632-F632))","v":1},"2014/12"]
["POMMERELL Patrick","2014-11-19","2014-11-21",0,"2014-11-21",0.5,"RTT","Acceptée",{"$f":"IF(OR(G633=\"Convention\",H633=\"Refusée\"),0,IF(H633=\"Annulée\",-(NETWORKDAYS.INTL(C633,E633,1,JFERIES)-D633-F633),NETWORKDAYS.INTL(C633,E633,1,JFERIES)-D633-F633))","v":0.5},"2014/11","Demande de CP transformée en RTT "]
["CHEVALIER Yohan","2014-11-19","2014-12-15",0,"2014-12-16",0,"CP","Refusée",{"$f":"IF(OR(G634=\"Convention\",H634=\"Refusée\"),0,IF(H634=\"Annulée\",-(NETWORKDAYS.INTL(C634,E634,1,JFERIES)-D634-F634),NETWORKDAYS.INTL(C634,E634,1,JFERIES)-D634-F634))","v":0},"2014/12","Trop de CP anticipés (solde de -6"]
["HEMLER Christelle","2014-11-24","2014-12-24",0.5,"2014-12-26",0,"RTT","Acceptée",{"$f":"IF(OR(G635=\"Convention\",H635=\"Refusée\"),0,IF(H635=\"Annulée\",-(NETWORKDAYS.INTL(C635,E635,1,JFERIES)-D635-F635),NETWORKDAYS.INTL(C635,E635,1,JFERIES)-D635-F635))","v":1.5},"2014/12"]
["LEDANT Charles","2014-11-25","2014-12-26",0,"2014-12-26",0,"RTT","Acceptée",{"$f":"IF(OR(G636=\"Convention\",H636=\"Refusée\"),0,IF(H636=\"Annulée\",-(NETWORKDAYS.INTL(C636,E636,1,JFERIES)-D636-F636),NETWORKDAYS.INTL(C636,E636,1,JFERIES)-D636-F636))","v":1},"2014/12"]
["LAZZARO Fabien","2014-11-25","2014-12-12",0,"2014-12-12",0,"RTT","Acceptée",{"$f":"IF(OR(G637=\"Convention\",H637=\"Refusée\"),0,IF(H637=\"Annulée\",-(NETWORKDAYS.INTL(C637,E637,1,JFERIES)-D637-F637),NETWORKDAYS.INTL(C637,E637,1,JFERIES)-D637-F637))","v":1},"2014/12"]
["MINAKIAN Mathilde","2014-11-25","2015-01-02",0,"2015-01-02",0,"CP","Acceptée",{"$f":"IF(OR(G638=\"Convention\",H638=\"Refusée\"),0,IF(H638=\"Annulée\",-(NETWORKDAYS.INTL(C638,E638,1,JFERIES)-D638-F638),NETWORKDAYS.INTL(C638,E638,1,JFERIES)-D638-F638))","v":1},"2015/01"]
["BERTHE Magali","2014-11-25","2015-01-02",0,"2015-01-02",0,"CP","Acceptée",{"$f":"IF(OR(G639=\"Convention\",H639=\"Refusée\"),0,IF(H639=\"Annulée\",-(NETWORKDAYS.INTL(C639,E639,1,JFERIES)-D639-F639),NETWORKDAYS.INTL(C639,E639,1,JFERIES)-D639-F639))","v":1},"2015/01"]
["COUTANT Jean Paul","2014-11-26","2014-12-26",0,"2014-12-26",0,"RTT","Acceptée",{"$f":"IF(OR(G640=\"Convention\",H640=\"Refusée\"),0,IF(H640=\"Annulée\",-(NETWORKDAYS.INTL(C640,E640,1,JFERIES)-D640-F640),NETWORKDAYS.INTL(C640,E640,1,JFERIES)-D640-F640))","v":1},"2014/12"]
["ROBIN Kevin","2014-11-26","2014-12-15",0,"2014-12-15",0.5,"CP","Acceptée",{"$f":"IF(OR(G641=\"Convention\",H641=\"Refusée\"),0,IF(H641=\"Annulée\",-(NETWORKDAYS.INTL(C641,E641,1,JFERIES)-D641-F641),NETWORKDAYS.INTL(C641,E641,1,JFERIES)-D641-F641))","v":0.5},"2014/12"]
["ROBIN Kevin","2014-11-26","2014-12-26",0,"2014-12-26",0,"CP","Acceptée",{"$f":"IF(OR(G642=\"Convention\",H642=\"Refusée\"),0,IF(H642=\"Annulée\",-(NETWORKDAYS.INTL(C642,E642,1,JFERIES)-D642-F642),NETWORKDAYS.INTL(C642,E642,1,JFERIES)-D642-F642))","v":1},"2014/12"]
["ROBIN Kevin","2014-11-26","2015-01-02",0,"2015-01-02",0,"CP","Acceptée",{"$f":"IF(OR(G643=\"Convention\",H643=\"Refusée\"),0,IF(H643=\"Annulée\",-(NETWORKDAYS.INTL(C643,E643,1,JFERIES)-D643-F643),NETWORKDAYS.INTL(C643,E643,1,JFERIES)-D643-F643))","v":1},"2015/01"]
["DEREPPE Bruno","2014-11-26","2014-12-26",0,"2014-12-26",0,"RTT","Acceptée",{"$f":"IF(OR(G644=\"Convention\",H644=\"Refusée\"),0,IF(H644=\"Annulée\",-(NETWORKDAYS.INTL(C644,E644,1,JFERIES)-D644-F644),NETWORKDAYS.INTL(C644,E644,1,JFERIES)-D644-F644))","v":1},"2014/12"]
["MARZOUK Sami","2014-11-27","2014-12-05",0,"2014-12-05",0,"RTT","Acceptée",{"$f":"IF(OR(G645=\"Convention\",H645=\"Refusée\"),0,IF(H645=\"Annulée\",-(NETWORKDAYS.INTL(C645,E645,1,JFERIES)-D645-F645),NETWORKDAYS.INTL(C645,E645,1,JFERIES)-D645-F645))","v":1},"2014/12"]
["POMMERELL Patrick","2014-11-06","2014-12-26",0,"2014-12-26",0,"RTT","Acceptée",{"$f":"IF(OR(G646=\"Convention\",H646=\"Refusée\"),0,IF(H646=\"Annulée\",-(NETWORKDAYS.INTL(C646,E646,1,JFERIES)-D646-F646),NETWORKDAYS.INTL(C646,E646,1,JFERIES)-D646-F646))","v":1},"2014/12"]
["SANTUCCI Lionel","2014-12-01","2014-12-01",0,"2014-12-01",0.5,"RTT","Acceptée",{"$f":"IF(OR(G647=\"Convention\",H647=\"Refusée\"),0,IF(H647=\"Annulée\",-(NETWORKDAYS.INTL(C647,E647,1,JFERIES)-D647-F647),NETWORKDAYS.INTL(C647,E647,1,JFERIES)-D647-F647))","v":0.5},"2014/12"]
["DEREPPE Bruno","2014-12-01","2014-12-24",0,"2014-12-24",0,"RTT","Acceptée",{"$f":"IF(OR(G648=\"Convention\",H648=\"Refusée\"),0,IF(H648=\"Annulée\",-(NETWORKDAYS.INTL(C648,E648,1,JFERIES)-D648-F648),NETWORKDAYS.INTL(C648,E648,1,JFERIES)-D648-F648))","v":1},"2014/12","Demande de CP transformée en RTT "]
["HEMLER Christelle","2014-12-02","2014-12-24",0.5,"2014-12-24",0,"CP","Acceptée",{"$f":"IF(OR(G649=\"Convention\",H649=\"Refusée\"),0,IF(H649=\"Annulée\",-(NETWORKDAYS.INTL(C649,E649,1,JFERIES)-D649-F649),NETWORKDAYS.INTL(C649,E649,1,JFERIES)-D649-F649))","v":0.5},"2014/12",null,25.46]
["CHEVALIER Yohan","2014-12-02","2014-12-03",0.5,"2014-12-03",0,"CP sans solde","Acceptée",{"$f":"IF(OR(G650=\"Convention\",H650=\"Refusée\"),0,IF(H650=\"Annulée\",-(NETWORKDAYS.INTL(C650,E650,1,JFERIES)-D650-F650),NETWORKDAYS.INTL(C650,E650,1,JFERIES)-D650-F650))","v":0.5},"2014/12",null,0]
["CHEVALIER Yohan","2014-12-02","2015-01-02",0,"2015-01-02",0,"CP sans solde","Acceptée",{"$f":"IF(OR(G651=\"Convention\",H651=\"Refusée\"),0,IF(H651=\"Annulée\",-(NETWORKDAYS.INTL(C651,E651,1,JFERIES)-D651-F651),NETWORKDAYS.INTL(C651,E651,1,JFERIES)-D651-F651))","v":1},"2015/01",null,0]
["DREZET Olivier","2014-12-01","2015-01-02",0,"2015-01-02",0,"RTT","Acceptée",{"$f":"IF(OR(G652=\"Convention\",H652=\"Refusée\"),0,IF(H652=\"Annulée\",-(NETWORKDAYS.INTL(C652,E652,1,JFERIES)-D652-F652),NETWORKDAYS.INTL(C652,E652,1,JFERIES)-D652-F652))","v":1},"2015/01","RTT Direction"]
["KADEM Christophe","2014-12-01","2015-01-02",0,"2015-01-02",0,"RTT","Acceptée",{"$f":"IF(OR(G653=\"Convention\",H653=\"Refusée\"),0,IF(H653=\"Annulée\",-(NETWORKDAYS.INTL(C653,E653,1,JFERIES)-D653-F653),NETWORKDAYS.INTL(C653,E653,1,JFERIES)-D653-F653))","v":1},"2015/01","RTT Direction"]
["SIODMAK Eric","2014-12-01","2015-01-02",0,"2015-01-02",0,"RTT","Acceptée",{"$f":"IF(OR(G654=\"Convention\",H654=\"Refusée\"),0,IF(H654=\"Annulée\",-(NETWORKDAYS.INTL(C654,E654,1,JFERIES)-D654-F654),NETWORKDAYS.INTL(C654,E654,1,JFERIES)-D654-F654))","v":1},"2015/01","RTT Direction"]
["TAQUET Alain","2014-12-01","2015-01-02",0,"2015-01-02",0,"RTT","Acceptée",{"$f":"IF(OR(G655=\"Convention\",H655=\"Refusée\"),0,IF(H655=\"Annulée\",-(NETWORKDAYS.INTL(C655,E655,1,JFERIES)-D655-F655),NETWORKDAYS.INTL(C655,E655,1,JFERIES)-D655-F655))","v":1},"2015/01","RTT Direction"]
["GUERIN Viviane","2014-12-01","2015-01-02",0,"2015-01-02",0,"RTT","Acceptée",{"$f":"IF(OR(G656=\"Convention\",H656=\"Refusée\"),0,IF(H656=\"Annulée\",-(NETWORKDAYS.INTL(C656,E656,1,JFERIES)-D656-F656),NETWORKDAYS.INTL(C656,E656,1,JFERIES)-D656-F656))","v":1},"2015/01","RTT Direction"]
["LAZZARO Fabien","2014-12-01","2015-01-02",0,"2015-01-02",0,"RTT","Acceptée",{"$f":"IF(OR(G657=\"Convention\",H657=\"Refusée\"),0,IF(H657=\"Annulée\",-(NETWORKDAYS.INTL(C657,E657,1,JFERIES)-D657-F657),NETWORKDAYS.INTL(C657,E657,1,JFERIES)-D657-F657))","v":1},"2015/01","RTT Direction"]
["MARZOUK Sami","2014-12-01","2015-01-02",0,"2015-01-02",0,"RTT","Acceptée",{"$f":"IF(OR(G658=\"Convention\",H658=\"Refusée\"),0,IF(H658=\"Annulée\",-(NETWORKDAYS.INTL(C658,E658,1,JFERIES)-D658-F658),NETWORKDAYS.INTL(C658,E658,1,JFERIES)-D658-F658))","v":1},"2015/01","RTT Direction"]
["SOUCHET Alain","2014-12-01","2015-01-02",0,"2015-01-02",0,"RTT","Acceptée",{"$f":"IF(OR(G659=\"Convention\",H659=\"Refusée\"),0,IF(H659=\"Annulée\",-(NETWORKDAYS.INTL(C659,E659,1,JFERIES)-D659-F659),NETWORKDAYS.INTL(C659,E659,1,JFERIES)-D659-F659))","v":1},"2015/01","RTT Direction"]
["POMMERELL Patrick","2014-12-01","2015-01-02",0,"2015-01-02",0,"RTT","Acceptée",{"$f":"IF(OR(G660=\"Convention\",H660=\"Refusée\"),0,IF(H660=\"Annulée\",-(NETWORKDAYS.INTL(C660,E660,1,JFERIES)-D660-F660),NETWORKDAYS.INTL(C660,E660,1,JFERIES)-D660-F660))","v":1},"2015/01","RTT Direction"]
["DEREPPE Bruno","2014-12-01","2015-01-02",0,"2015-01-02",0,"RTT","Acceptée",{"$f":"IF(OR(G661=\"Convention\",H661=\"Refusée\"),0,IF(H661=\"Annulée\",-(NETWORKDAYS.INTL(C661,E661,1,JFERIES)-D661-F661),NETWORKDAYS.INTL(C661,E661,1,JFERIES)-D661-F661))","v":1},"2015/01","RTT Direction"]
["COUTANT Jean Paul","2014-12-01","2015-01-02",0,"2015-01-02",0,"RTT","Acceptée",{"$f":"IF(OR(G662=\"Convention\",H662=\"Refusée\"),0,IF(H662=\"Annulée\",-(NETWORKDAYS.INTL(C662,E662,1,JFERIES)-D662-F662),NETWORKDAYS.INTL(C662,E662,1,JFERIES)-D662-F662))","v":1},"2015/01","RTT Direction"]
["PONS Olivier","2014-12-01","2015-01-02",0,"2015-01-02",0,"RTT","Acceptée",{"$f":"IF(OR(G663=\"Convention\",H663=\"Refusée\"),0,IF(H663=\"Annulée\",-(NETWORKDAYS.INTL(C663,E663,1,JFERIES)-D663-F663),NETWORKDAYS.INTL(C663,E663,1,JFERIES)-D663-F663))","v":1},"2015/01","RTT Direction"]
["GIRAUDON Alain","2014-11-18","2014-12-31",0,"2014-12-31",0.5,"RTT","Acceptée",{"$f":"IF(OR(G664=\"Convention\",H664=\"Refusée\"),0,IF(H664=\"Annulée\",-(NETWORKDAYS.INTL(C664,E664,1,JFERIES)-D664-F664),NETWORKDAYS.INTL(C664,E664,1,JFERIES)-D664-F664))","v":0.5},"2014/12"]
["GIRAUDON Alain","2014-12-01","2015-01-02",0,"2015-01-02",0,"RTT","Acceptée",{"$f":"IF(OR(G665=\"Convention\",H665=\"Refusée\"),0,IF(H665=\"Annulée\",-(NETWORKDAYS.INTL(C665,E665,1,JFERIES)-D665-F665),NETWORKDAYS.INTL(C665,E665,1,JFERIES)-D665-F665))","v":1},"2015/01","RTT Direction"]
["LOYER Michel","2014-12-01","2015-01-02",0,"2015-01-02",0,"RTT","Acceptée",{"$f":"IF(OR(G666=\"Convention\",H666=\"Refusée\"),0,IF(H666=\"Annulée\",-(NETWORKDAYS.INTL(C666,E666,1,JFERIES)-D666-F666),NETWORKDAYS.INTL(C666,E666,1,JFERIES)-D666-F666))","v":1},"2015/01","RTT Direction"]
["DREVON Alain","2014-12-01","2015-01-02",0,"2015-01-02",0,"RTT","Acceptée",{"$f":"IF(OR(G667=\"Convention\",H667=\"Refusée\"),0,IF(H667=\"Annulée\",-(NETWORKDAYS.INTL(C667,E667,1,JFERIES)-D667-F667),NETWORKDAYS.INTL(C667,E667,1,JFERIES)-D667-F667))","v":1},"2015/01","RTT Direction"]
["BEARZATTO Giovanni","2014-12-01","2015-01-02",0,"2015-01-02",0,"RTT","Acceptée",{"$f":"IF(OR(G668=\"Convention\",H668=\"Refusée\"),0,IF(H668=\"Annulée\",-(NETWORKDAYS.INTL(C668,E668,1,JFERIES)-D668-F668),NETWORKDAYS.INTL(C668,E668,1,JFERIES)-D668-F668))","v":1},"2015/01","RTT Direction"]
["LOCATELLI Bruno","2014-12-01","2015-01-02",0,"2015-01-02",0,"RTT","Acceptée",{"$f":"IF(OR(G669=\"Convention\",H669=\"Refusée\"),0,IF(H669=\"Annulée\",-(NETWORKDAYS.INTL(C669,E669,1,JFERIES)-D669-F669),NETWORKDAYS.INTL(C669,E669,1,JFERIES)-D669-F669))","v":1},"2015/01","RTT Direction"]
["SANTUCCI Lionel","2014-12-01","2015-01-02",0,"2015-01-02",0,"RTT","Acceptée",{"$f":"IF(OR(G670=\"Convention\",H670=\"Refusée\"),0,IF(H670=\"Annulée\",-(NETWORKDAYS.INTL(C670,E670,1,JFERIES)-D670-F670),NETWORKDAYS.INTL(C670,E670,1,JFERIES)-D670-F670))","v":1},"2015/01","RTT Direction"]
["VAUTRAIN Franck","2014-12-01","2015-01-02",0,"2015-01-02",0,"RTT","Acceptée",{"$f":"IF(OR(G671=\"Convention\",H671=\"Refusée\"),0,IF(H671=\"Annulée\",-(NETWORKDAYS.INTL(C671,E671,1,JFERIES)-D671-F671),NETWORKDAYS.INTL(C671,E671,1,JFERIES)-D671-F671))","v":1},"2015/01","RTT Direction"]
["LEDANT Charles","2014-12-01","2015-01-02",0,"2015-01-02",0,"RTT","Acceptée",{"$f":"IF(OR(G672=\"Convention\",H672=\"Refusée\"),0,IF(H672=\"Annulée\",-(NETWORKDAYS.INTL(C672,E672,1,JFERIES)-D672-F672),NETWORKDAYS.INTL(C672,E672,1,JFERIES)-D672-F672))","v":1},"2015/01","RTT Direction"]
["HAUTEBRANC Alexis","2014-12-01","2015-01-02",0,"2015-01-02",0,"RTT","Acceptée",{"$f":"IF(OR(G673=\"Convention\",H673=\"Refusée\"),0,IF(H673=\"Annulée\",-(NETWORKDAYS.INTL(C673,E673,1,JFERIES)-D673-F673),NETWORKDAYS.INTL(C673,E673,1,JFERIES)-D673-F673))","v":1},"2015/01","RTT Direction"]
["HEMLER Christelle","2014-12-01","2015-01-02",0,"2015-01-02",0,"RTT","Acceptée",{"$f":"IF(OR(G674=\"Convention\",H674=\"Refusée\"),0,IF(H674=\"Annulée\",-(NETWORKDAYS.INTL(C674,E674,1,JFERIES)-D674-F674),NETWORKDAYS.INTL(C674,E674,1,JFERIES)-D674-F674))","v":1},"2015/01","RTT Direction"]
["GUIOT Fabien","2014-12-01","2015-01-02",0,"2015-01-02",0,"RTT","Acceptée",{"$f":"IF(OR(G675=\"Convention\",H675=\"Refusée\"),0,IF(H675=\"Annulée\",-(NETWORKDAYS.INTL(C675,E675,1,JFERIES)-D675-F675),NETWORKDAYS.INTL(C675,E675,1,JFERIES)-D675-F675))","v":1},"2015/01","RTT Direction"]
["GUINOT Nathalie","2014-12-01","2015-01-02",0,"2015-01-02",0,"RTT","Acceptée",{"$f":"IF(OR(G676=\"Convention\",H676=\"Refusée\"),0,IF(H676=\"Annulée\",-(NETWORKDAYS.INTL(C676,E676,1,JFERIES)-D676-F676),NETWORKDAYS.INTL(C676,E676,1,JFERIES)-D676-F676))","v":1},"2015/01","RTT Direction"]
["LANGE Sébastien","2014-12-01","2015-01-02",0,"2015-01-02",0,"CP","Acceptée",{"$f":"IF(OR(G677=\"Convention\",H677=\"Refusée\"),0,IF(H677=\"Annulée\",-(NETWORKDAYS.INTL(C677,E677,1,JFERIES)-D677-F677),NETWORKDAYS.INTL(C677,E677,1,JFERIES)-D677-F677))","v":1},"2015/01","CP"]
["GUINOT Nathalie","2015-02-23","2015-02-23",0,"2015-02-27",0,"CP","Acceptée",{"$f":"IF(OR(G678=\"Convention\",H678=\"Refusée\"),0,IF(H678=\"Annulée\",-(NETWORKDAYS.INTL(C678,E678,1,JFERIES)-D678-F678),NETWORKDAYS.INTL(C678,E678,1,JFERIES)-D678-F678))","v":5},"2015/02"]
["GUINOT Nathalie","2014-12-04","2014-12-22",0,"2014-12-23",0,"RTT","Acceptée",{"$f":"IF(OR(G679=\"Convention\",H679=\"Refusée\"),0,IF(H679=\"Annulée\",-(NETWORKDAYS.INTL(C679,E679,1,JFERIES)-D679-F679),NETWORKDAYS.INTL(C679,E679,1,JFERIES)-D679-F679))","v":2},"2014/12"]
["SANTUCCI Lionel","2014-12-08","2014-12-10",0,"2014-12-11",0,"RTT","Acceptée",{"$f":"IF(OR(G680=\"Convention\",H680=\"Refusée\"),0,IF(H680=\"Annulée\",-(NETWORKDAYS.INTL(C680,E680,1,JFERIES)-D680-F680),NETWORKDAYS.INTL(C680,E680,1,JFERIES)-D680-F680))","v":2},"2014/12"]
["VAUTRAIN Franck","2014-12-08","2014-12-25",0,"2014-12-31",0,"CP","Refusée",{"$f":"IF(OR(G681=\"Convention\",H681=\"Refusée\"),0,IF(H681=\"Annulée\",-(NETWORKDAYS.INTL(C681,E681,1,JFERIES)-D681-F681),NETWORKDAYS.INTL(C681,E681,1,JFERIES)-D681-F681))","v":0},"2014/12","Période rouge "]
["VAUTRAIN Franck","2014-12-08","2014-12-26",0,"2014-12-26",0,"RTT","Acceptée",{"$f":"IF(OR(G682=\"Convention\",H682=\"Refusée\"),0,IF(H682=\"Annulée\",-(NETWORKDAYS.INTL(C682,E682,1,JFERIES)-D682-F682),NETWORKDAYS.INTL(C682,E682,1,JFERIES)-D682-F682))","v":1},"2014/12"]
["VAUTRAIN Franck","2014-12-08","2014-12-31",0,"2014-12-31",0,"RTT","Acceptée",{"$f":"IF(OR(G683=\"Convention\",H683=\"Refusée\"),0,IF(H683=\"Annulée\",-(NETWORKDAYS.INTL(C683,E683,1,JFERIES)-D683-F683),NETWORKDAYS.INTL(C683,E683,1,JFERIES)-D683-F683))","v":1},"2014/12"]
["MARZOUK Sami","2014-12-10","2014-12-11",0,"2014-12-11",0,"RTT","Acceptée",{"$f":"IF(OR(G684=\"Convention\",H684=\"Refusée\"),0,IF(H684=\"Annulée\",-(NETWORKDAYS.INTL(C684,E684,1,JFERIES)-D684-F684),NETWORKDAYS.INTL(C684,E684,1,JFERIES)-D684-F684))","v":1},"2014/12"]
["BEARZATTO Giovanni","2014-12-11","2014-12-19",0,"2014-12-19",0,"RTT","Acceptée",{"$f":"IF(OR(G685=\"Convention\",H685=\"Refusée\"),0,IF(H685=\"Annulée\",-(NETWORKDAYS.INTL(C685,E685,1,JFERIES)-D685-F685),NETWORKDAYS.INTL(C685,E685,1,JFERIES)-D685-F685))","v":1},"2014/12"]
["BEARZATTO Giovanni","2014-12-11","2014-12-31",0,"2014-12-31",0,"RTT","Acceptée",{"$f":"IF(OR(G686=\"Convention\",H686=\"Refusée\"),0,IF(H686=\"Annulée\",-(NETWORKDAYS.INTL(C686,E686,1,JFERIES)-D686-F686),NETWORKDAYS.INTL(C686,E686,1,JFERIES)-D686-F686))","v":1},"2014/12"]
["GUIOT Fabien","2014-12-12","2014-12-26",0,"2014-12-26",0,"CP","Acceptée",{"$f":"IF(OR(G687=\"Convention\",H687=\"Refusée\"),0,IF(H687=\"Annulée\",-(NETWORKDAYS.INTL(C687,E687,1,JFERIES)-D687-F687),NETWORKDAYS.INTL(C687,E687,1,JFERIES)-D687-F687))","v":1},"2014/12"]
["COUTANT Jean Paul","2014-12-15","2014-12-16",0,"2014-12-16",0.5,"RTT","Acceptée",{"$f":"IF(OR(G688=\"Convention\",H688=\"Refusée\"),0,IF(H688=\"Annulée\",-(NETWORKDAYS.INTL(C688,E688,1,JFERIES)-D688-F688),NETWORKDAYS.INTL(C688,E688,1,JFERIES)-D688-F688))","v":0.5},"2014/12"]
["VAUTRAIN Franck","2014-12-15","2014-12-22",0,"2014-12-22",0,"RTT","Acceptée",{"$f":"IF(OR(G689=\"Convention\",H689=\"Refusée\"),0,IF(H689=\"Annulée\",-(NETWORKDAYS.INTL(C689,E689,1,JFERIES)-D689-F689),NETWORKDAYS.INTL(C689,E689,1,JFERIES)-D689-F689))","v":1},"2014/12"]
["DREVON Alain","2014-12-11","2014-12-24",0,"2014-12-26",0,"RTT","Acceptée",{"$f":"IF(OR(G690=\"Convention\",H690=\"Refusée\"),0,IF(H690=\"Annulée\",-(NETWORKDAYS.INTL(C690,E690,1,JFERIES)-D690-F690),NETWORKDAYS.INTL(C690,E690,1,JFERIES)-D690-F690))","v":2},"2014/12"]
["DREVON Alain","2014-12-11","2014-12-31",0,"2014-12-31",0,"RTT","Acceptée",{"$f":"IF(OR(G691=\"Convention\",H691=\"Refusée\"),0,IF(H691=\"Annulée\",-(NETWORKDAYS.INTL(C691,E691,1,JFERIES)-D691-F691),NETWORKDAYS.INTL(C691,E691,1,JFERIES)-D691-F691))","v":1},"2014/12"]
["SIODMAK Eric","2014-12-15","2014-12-18",0.5,"2014-12-18",0,"RTT","Acceptée",{"$f":"IF(OR(G692=\"Convention\",H692=\"Refusée\"),0,IF(H692=\"Annulée\",-(NETWORKDAYS.INTL(C692,E692,1,JFERIES)-D692-F692),NETWORKDAYS.INTL(C692,E692,1,JFERIES)-D692-F692))","v":0.5},"2014/12"]
["LOYER Michel","2014-12-15","2014-12-26",0,"2014-12-26",0,"CP","Acceptée",{"$f":"IF(OR(G693=\"Convention\",H693=\"Refusée\"),0,IF(H693=\"Annulée\",-(NETWORKDAYS.INTL(C693,E693,1,JFERIES)-D693-F693),NETWORKDAYS.INTL(C693,E693,1,JFERIES)-D693-F693))","v":1},"2014/12"]
["GUIOT Fabien","2014-12-12","2014-12-24",0,"2014-12-24",0,"RTT","Acceptée",{"$f":"IF(OR(G694=\"Convention\",H694=\"Refusée\"),0,IF(H694=\"Annulée\",-(NETWORKDAYS.INTL(C694,E694,1,JFERIES)-D694-F694),NETWORKDAYS.INTL(C694,E694,1,JFERIES)-D694-F694))","v":1},"2014/12"]
["GUERIN Viviane","2014-12-10","2014-01-29",0,"2014-01-30",0,"RTD Recup","Acceptée",{"$f":"IF(OR(G695=\"Convention\",H695=\"Refusée\"),0,IF(H695=\"Annulée\",-(NETWORKDAYS.INTL(C695,E695,1,JFERIES)-D695-F695),NETWORKDAYS.INTL(C695,E695,1,JFERIES)-D695-F695))","v":2},"2014/01","ARTD 2014"]
["LEDANT Charles","2014-12-16","2014-12-16",0,"2014-12-16",0.5,"RTT","Acceptée",{"$f":"IF(OR(G696=\"Convention\",H696=\"Refusée\"),0,IF(H696=\"Annulée\",-(NETWORKDAYS.INTL(C696,E696,1,JFERIES)-D696-F696),NETWORKDAYS.INTL(C696,E696,1,JFERIES)-D696-F696))","v":0.5},"2014/12"]
["PONS Olivier","2014-12-17","2014-12-24",0,"2014-12-26",0,"RTT","Acceptée",{"$f":"IF(OR(G697=\"Convention\",H697=\"Refusée\"),0,IF(H697=\"Annulée\",-(NETWORKDAYS.INTL(C697,E697,1,JFERIES)-D697-F697),NETWORKDAYS.INTL(C697,E697,1,JFERIES)-D697-F697))","v":2},"2014/12","",4.5]
["PONS Olivier","2014-12-17","2014-12-31",0,"2014-12-31",0,"RTT","Acceptée",{"$f":"IF(OR(G698=\"Convention\",H698=\"Refusée\"),0,IF(H698=\"Annulée\",-(NETWORKDAYS.INTL(C698,E698,1,JFERIES)-D698-F698),NETWORKDAYS.INTL(C698,E698,1,JFERIES)-D698-F698))","v":1},"2014/12"]
["LEDANT Charles","2014-12-17","2014-12-19",0,"2014-12-19",0,"Convention","Acceptée",{"$f":"IF(OR(G699=\"Convention\",H699=\"Refusée\"),0,IF(H699=\"Annulée\",-(NETWORKDAYS.INTL(C699,E699,1,JFERIES)-D699-F699),NETWORKDAYS.INTL(C699,E699,1,JFERIES)-D699-F699))","v":0},"2014/12","Décès Belle-mère"]
["LEDANT Charles","2014-12-17","2014-12-23",0,"2014-12-23",0.5,"RTT","Acceptée",{"$f":"IF(OR(G700=\"Convention\",H700=\"Refusée\"),0,IF(H700=\"Annulée\",-(NETWORKDAYS.INTL(C700,E700,1,JFERIES)-D700-F700),NETWORKDAYS.INTL(C700,E700,1,JFERIES)-D700-F700))","v":0.5},"2014/12"]
["LOCATELLI Bruno","2014-12-19","2015-03-09",0,"2015-03-13",0,"CP","Acceptée",{"$f":"IF(OR(G701=\"Convention\",H701=\"Refusée\"),0,IF(H701=\"Annulée\",-(NETWORKDAYS.INTL(C701,E701,1,JFERIES)-D701-F701),NETWORKDAYS.INTL(C701,E701,1,JFERIES)-D701-F701))","v":5},"2015/03",0,5.9600000000000009]
["SIODMAK Eric","2014-12-22","2014-12-31",0,"2014-12-31",0,"CP","Acceptée",{"$f":"IF(OR(G702=\"Convention\",H702=\"Refusée\"),0,IF(H702=\"Annulée\",-(NETWORKDAYS.INTL(C702,E702,1,JFERIES)-D702-F702),NETWORKDAYS.INTL(C702,E702,1,JFERIES)-D702-F702))","v":1},"2014/12",0,10.96]
["SANTUCCI Lionel","2014-12-22","2014-12-23",0,"2014-12-23",0,"RTT","Acceptée",{"$f":"IF(OR(G703=\"Convention\",H703=\"Refusée\"),0,IF(H703=\"Annulée\",-(NETWORKDAYS.INTL(C703,E703,1,JFERIES)-D703-F703),NETWORKDAYS.INTL(C703,E703,1,JFERIES)-D703-F703))","v":1},"2014/12",0,0.5]
["SANTUCCI Lionel","2014-12-22","2014-12-26",0,"2014-12-26",0,"CP","Acceptée",{"$f":"IF(OR(G704=\"Convention\",H704=\"Refusée\"),0,IF(H704=\"Annulée\",-(NETWORKDAYS.INTL(C704,E704,1,JFERIES)-D704-F704),NETWORKDAYS.INTL(C704,E704,1,JFERIES)-D704-F704))","v":1},"2014/12",0,12.96]
["LOCATELLI Bruno","2014-12-22","2014-12-31",0,"2014-12-31",0,"RTT","Acceptée",{"$f":"IF(OR(G705=\"Convention\",H705=\"Refusée\"),0,IF(H705=\"Annulée\",-(NETWORKDAYS.INTL(C705,E705,1,JFERIES)-D705-F705),NETWORKDAYS.INTL(C705,E705,1,JFERIES)-D705-F705))","v":1},"2014/12",0,1.5]
["GIRAUDON Alain","2014-12-29","2015-03-09",0,"2015-03-13",0,"CP","Acceptée",{"$f":"IF(OR(G706=\"Convention\",H706=\"Refusée\"),0,IF(H706=\"Annulée\",-(NETWORKDAYS.INTL(C706,E706,1,JFERIES)-D706-F706),NETWORKDAYS.INTL(C706,E706,1,JFERIES)-D706-F706))","v":5},"2015/03",0,-3.9999999999999147E-2]
["MARZOUK Sami","2014-12-30","2014-12-31",0,"2014-12-31",0,"CP","Acceptée",{"$f":"IF(OR(G707=\"Convention\",H707=\"Refusée\"),0,IF(H707=\"Annulée\",-(NETWORKDAYS.INTL(C707,E707,1,JFERIES)-D707-F707),NETWORKDAYS.INTL(C707,E707,1,JFERIES)-D707-F707))","v":1},"2014/12",0,7.9600000000000009]
["LOCATELLI Bruno","2015-01-05","2015-01-19",0,"2015-01-19",0,"RTT","Acceptée",{"$f":"IF(OR(G708=\"Convention\",H708=\"Refusée\"),0,IF(H708=\"Annulée\",-(NETWORKDAYS.INTL(C708,E708,1,JFERIES)-D708-F708),NETWORKDAYS.INTL(C708,E708,1,JFERIES)-D708-F708))","v":1},"2015/01",0,0.5]
["LOYER Michel","2015-01-05","2015-05-07",0,"2015-05-07",0,"RTT","Acceptée",{"$f":"IF(OR(G709=\"Convention\",H709=\"Refusée\"),0,IF(H709=\"Annulée\",-(NETWORKDAYS.INTL(C709,E709,1,JFERIES)-D709-F709),NETWORKDAYS.INTL(C709,E709,1,JFERIES)-D709-F709))","v":1},"2015/05",0,-0.5]
["LOYER Michel","2015-01-05","2015-05-04",0,"2015-05-06",0,"CP","Acceptée",{"$f":"IF(OR(G710=\"Convention\",H710=\"Refusée\"),0,IF(H710=\"Annulée\",-(NETWORKDAYS.INTL(C710,E710,1,JFERIES)-D710-F710),NETWORKDAYS.INTL(C710,E710,1,JFERIES)-D710-F710))","v":3},"2015/05",0,1.9600000000000009]
["SANTUCCI Lionel","2015-01-05","2015-01-16",0,"2015-01-16",0,"RTT","Acceptée",{"$f":"IF(OR(G711=\"Convention\",H711=\"Refusée\"),0,IF(H711=\"Annulée\",-(NETWORKDAYS.INTL(C711,E711,1,JFERIES)-D711-F711),NETWORKDAYS.INTL(C711,E711,1,JFERIES)-D711-F711))","v":1},"2015/01","Remplacement de la journée non prise lors de ta dernière venue.",-0.5]
["PONS Olivier","2015-01-07","2015-01-09",0,"2015-01-09",0,"RTT","Acceptée",{"$f":"IF(OR(G712=\"Convention\",H712=\"Refusée\"),0,IF(H712=\"Annulée\",-(NETWORKDAYS.INTL(C712,E712,1,JFERIES)-D712-F712),NETWORKDAYS.INTL(C712,E712,1,JFERIES)-D712-F712))","v":1},"2015/01",0,2.5]
["BEARZATTO Giovanni","2015-01-07","2015-02-19",0,"2015-02-19",0,"RTT","Acceptée",{"$f":"IF(OR(G713=\"Convention\",H713=\"Refusée\"),0,IF(H713=\"Annulée\",-(NETWORKDAYS.INTL(C713,E713,1,JFERIES)-D713-F713),NETWORKDAYS.INTL(C713,E713,1,JFERIES)-D713-F713))","v":1},"2015/02",0,1]
["BEARZATTO Giovanni","2015-01-07","2015-02-20",0,"2015-02-27",0,"CP","Acceptée",{"$f":"IF(OR(G714=\"Convention\",H714=\"Refusée\"),0,IF(H714=\"Annulée\",-(NETWORKDAYS.INTL(C714,E714,1,JFERIES)-D714-F714),NETWORKDAYS.INTL(C714,E714,1,JFERIES)-D714-F714))","v":6},"2015/02",0,4.4600000000000009]
["BEARZATTO Giovanni","2015-01-07","2015-03-01",0,"2015-03-03",0,"CP","Acceptée",{"$f":"IF(OR(G715=\"Convention\",H715=\"Refusée\"),0,IF(H715=\"Annulée\",-(NETWORKDAYS.INTL(C715,E715,1,JFERIES)-D715-F715),NETWORKDAYS.INTL(C715,E715,1,JFERIES)-D715-F715))","v":2},"2015/03",0,8.4600000000000009]
["BEARZATTO Giovanni","2015-01-07","2015-03-04",0,"2015-03-04",0,"RTT","Acceptée",{"$f":"IF(OR(G716=\"Convention\",H716=\"Refusée\"),0,IF(H716=\"Annulée\",-(NETWORKDAYS.INTL(C716,E716,1,JFERIES)-D716-F716),NETWORKDAYS.INTL(C716,E716,1,JFERIES)-D716-F716))","v":1},"2015/03",0,1]
["LAZZARO Fabien","2015-01-08","2015-01-30",0,"2015-01-30",0,"RTD Recup","Acceptée",{"$f":"IF(OR(G717=\"Convention\",H717=\"Refusée\"),0,IF(H717=\"Annulée\",-(NETWORKDAYS.INTL(C717,E717,1,JFERIES)-D717-F717),NETWORKDAYS.INTL(C717,E717,1,JFERIES)-D717-F717))","v":1},"2015/01","",""]
["VAUTRAIN Franck","2015-01-08","2015-01-12",0,"2015-01-12",0,"RTT","Acceptée",{"$f":"IF(OR(G718=\"Convention\",H718=\"Refusée\"),0,IF(H718=\"Annulée\",-(NETWORKDAYS.INTL(C718,E718,1,JFERIES)-D718-F718),NETWORKDAYS.INTL(C718,E718,1,JFERIES)-D718-F718))","v":1},"2015/01","",2.5]
["LOCATELLI Bruno","2015-01-12","2015-01-27",0,"2015-01-27",0,"RTT","Acceptée",{"$f":"IF(OR(G719=\"Convention\",H719=\"Refusée\"),0,IF(H719=\"Annulée\",-(NETWORKDAYS.INTL(C719,E719,1,JFERIES)-D719-F719),NETWORKDAYS.INTL(C719,E719,1,JFERIES)-D719-F719))","v":1},"2015/01","",0]
["KADEM Christophe","2015-01-14","2015-03-02",0,"2015-03-06",0,"CP","Acceptée",{"$f":"IF(OR(G720=\"Convention\",H720=\"Refusée\"),0,IF(H720=\"Annulée\",-(NETWORKDAYS.INTL(C720,E720,1,JFERIES)-D720-F720),NETWORKDAYS.INTL(C720,E720,1,JFERIES)-D720-F720))","v":5},"2015/03","",5.4600000000000009]
["PONS Olivier","2015-01-19","2015-02-06",0,"2015-02-06",0,"RTT","Acceptée",{"$f":"IF(OR(G721=\"Convention\",H721=\"Refusée\"),0,IF(H721=\"Annulée\",-(NETWORKDAYS.INTL(C721,E721,1,JFERIES)-D721-F721),NETWORKDAYS.INTL(C721,E721,1,JFERIES)-D721-F721))","v":1},"2015/02","",2]
["GUERIN Viviane","2015-01-20","2015-01-23",0,"2015-01-23",0,"RTT","Acceptée",{"$f":"IF(OR(G722=\"Convention\",H722=\"Refusée\"),0,IF(H722=\"Annulée\",-(NETWORKDAYS.INTL(C722,E722,1,JFERIES)-D722-F722),NETWORKDAYS.INTL(C722,E722,1,JFERIES)-D722-F722))","v":1},"2015/01","",1]
["TAQUET Alain","2015-01-21","2015-03-02",0,"2015-03-05",0,"CP","Acceptée",{"$f":"IF(OR(G723=\"Convention\",H723=\"Refusée\"),0,IF(H723=\"Annulée\",-(NETWORKDAYS.INTL(C723,E723,1,JFERIES)-D723-F723),NETWORKDAYS.INTL(C723,E723,1,JFERIES)-D723-F723))","v":4},"2015/03","",6.9600000000000009]
["TAQUET Alain","2015-01-21","2015-03-06",0,"2015-03-06",0,"RTT","Acceptée",{"$f":"IF(OR(G724=\"Convention\",H724=\"Refusée\"),0,IF(H724=\"Annulée\",-(NETWORKDAYS.INTL(C724,E724,1,JFERIES)-D724-F724),NETWORKDAYS.INTL(C724,E724,1,JFERIES)-D724-F724))","v":1},"2015/03","",2]
["TAQUET Alain","2015-01-21","2015-02-27",0,"2015-02-27",0,"RTT","Acceptée",{"$f":"IF(OR(G725=\"Convention\",H725=\"Refusée\"),0,IF(H725=\"Annulée\",-(NETWORKDAYS.INTL(C725,E725,1,JFERIES)-D725-F725),NETWORKDAYS.INTL(C725,E725,1,JFERIES)-D725-F725))","v":1},"2015/02","",2]
["VAUTRAIN Franck","2015-01-23","2015-01-30",0,"2015-01-30",0,"RTT","Annulée",{"$f":"IF(OR(G726=\"Convention\",H726=\"Refusée\"),0,IF(H726=\"Annulée\",-(NETWORKDAYS.INTL(C726,E726,1,JFERIES)-D726-F726),NETWORKDAYS.INTL(C726,E726,1,JFERIES)-D726-F726))","v":-1},"2015/01","reportée au 13/02 par FV",1]
["POMMERELL Patrick","2015-01-25","2015-04-27",0,"2015-04-30",0,"CP","Acceptée",{"$f":"IF(OR(G727=\"Convention\",H727=\"Refusée\"),0,IF(H727=\"Annulée\",-(NETWORKDAYS.INTL(C727,E727,1,JFERIES)-D727-F727),NETWORKDAYS.INTL(C727,E727,1,JFERIES)-D727-F727))","v":4},"2015/04",null,9.4600000000000009]
["POMMERELL Patrick","2015-01-25","2015-05-25",0,"2015-05-25",0,"CP","Acceptée",{"$f":"IF(OR(G728=\"Convention\",H728=\"Refusée\"),0,IF(H728=\"Annulée\",-(NETWORKDAYS.INTL(C728,E728,1,JFERIES)-D728-F728),NETWORKDAYS.INTL(C728,E728,1,JFERIES)-D728-F728))","v":0},"2015/05",null,12.46]
["MARAIS Bernard","2015-01-26","2015-08-10",0,"2015-08-14",0,"CP","Acceptée",{"$f":"IF(OR(G729=\"Convention\",H729=\"Refusée\"),0,IF(H729=\"Annulée\",-(NETWORKDAYS.INTL(C729,E729,1,JFERIES)-D729-F729),NETWORKDAYS.INTL(C729,E729,1,JFERIES)-D729-F729))","v":5},"2015/08","Congés eté 2015",-3.0399999999999991]
["MARAIS Bernard","2015-01-26","2015-08-17",0,"2015-08-21",0,"CP","Acceptée",{"$f":"IF(OR(G730=\"Convention\",H730=\"Refusée\"),0,IF(H730=\"Annulée\",-(NETWORKDAYS.INTL(C730,E730,1,JFERIES)-D730-F730),NETWORKDAYS.INTL(C730,E730,1,JFERIES)-D730-F730))","v":5},"2015/08","Congés eté 2015",-3.0399999999999991]
["ROBIN Kevin","2015-01-26","2015-02-09",0,"2015-02-09",0,"CP","Acceptée",{"$f":"IF(OR(G731=\"Convention\",H731=\"Refusée\"),0,IF(H731=\"Annulée\",-(NETWORKDAYS.INTL(C731,E731,1,JFERIES)-D731-F731),NETWORKDAYS.INTL(C731,E731,1,JFERIES)-D731-F731))","v":1},"2015/02"]
["LOYER Michel","2015-01-26","2015-03-03",0,"2015-03-04",0,"CP","Acceptée",{"$f":"IF(OR(G732=\"Convention\",H732=\"Refusée\"),0,IF(H732=\"Annulée\",-(NETWORKDAYS.INTL(C732,E732,1,JFERIES)-D732-F732),NETWORKDAYS.INTL(C732,E732,1,JFERIES)-D732-F732))","v":2},"2015/03","",-3.9999999999999147E-2]
["LOYER Michel","2015-01-26","2015-03-02",0,"2015-03-02",0,"RTT","Acceptée",{"$f":"IF(OR(G733=\"Convention\",H733=\"Refusée\"),0,IF(H733=\"Annulée\",-(NETWORKDAYS.INTL(C733,E733,1,JFERIES)-D733-F733),NETWORKDAYS.INTL(C733,E733,1,JFERIES)-D733-F733))","v":1},"2015/03","",-1]
["VAUTRAIN Franck","2015-01-29","2015-02-13",0,"2015-02-13",0,"RTT","Acceptée",{"$f":"IF(OR(G734=\"Convention\",H734=\"Refusée\"),0,IF(H734=\"Annulée\",-(NETWORKDAYS.INTL(C734,E734,1,JFERIES)-D734-F734),NETWORKDAYS.INTL(C734,E734,1,JFERIES)-D734-F734))","v":1},"2015/02"]
["LEDANT Charles","2015-02-02","2015-01-29",0,"2015-01-30",0,"CP","Acceptée",{"$f":"IF(OR(G735=\"Convention\",H735=\"Refusée\"),0,IF(H735=\"Annulée\",-(NETWORKDAYS.INTL(C735,E735,1,JFERIES)-D735-F735),NETWORKDAYS.INTL(C735,E735,1,JFERIES)-D735-F735))","v":2},"2015/01","Malade",8.9600000000000009]
["HAUTEBRANC Alexis","2015-01-28","2015-05-26",0,"2015-05-29",0,"CP","Acceptée",{"$f":"IF(OR(G736=\"Convention\",H736=\"Refusée\"),0,IF(H736=\"Annulée\",-(NETWORKDAYS.INTL(C736,E736,1,JFERIES)-D736-F736),NETWORKDAYS.INTL(C736,E736,1,JFERIES)-D736-F736))","v":4},"2015/05"]
["HEMLER Christelle","2015-02-03","2015-02-05",0.5,"2015-02-05",0,"RTT","Acceptée",{"$f":"IF(OR(G737=\"Convention\",H737=\"Refusée\"),0,IF(H737=\"Annulée\",-(NETWORKDAYS.INTL(C737,E737,1,JFERIES)-D737-F737),NETWORKDAYS.INTL(C737,E737,1,JFERIES)-D737-F737))","v":0.5},"2015/02","",0.5]
["DREZET Olivier","2015-02-04","2015-04-27",0,"2015-04-30",0,"CP","Acceptée",{"$f":"IF(OR(G738=\"Convention\",H738=\"Refusée\"),0,IF(H738=\"Annulée\",-(NETWORKDAYS.INTL(C738,E738,1,JFERIES)-D738-F738),NETWORKDAYS.INTL(C738,E738,1,JFERIES)-D738-F738))","v":4},"2015/04","",4.4600000000000009]
["DREVON Alain","2015-02-08","2015-02-16",0,"2015-02-20",0,"CP","Acceptée",{"$f":"IF(OR(G739=\"Convention\",H739=\"Refusée\"),0,IF(H739=\"Annulée\",-(NETWORKDAYS.INTL(C739,E739,1,JFERIES)-D739-F739),NETWORKDAYS.INTL(C739,E739,1,JFERIES)-D739-F739))","v":5},"2015/02","",5.4600000000000009]
["GIRAUDON Alain","2015-02-09","2015-02-20",0,"2015-02-20",0,"RTT","Acceptée",{"$f":"IF(OR(G740=\"Convention\",H740=\"Refusée\"),0,IF(H740=\"Annulée\",-(NETWORKDAYS.INTL(C740,E740,1,JFERIES)-D740-F740),NETWORKDAYS.INTL(C740,E740,1,JFERIES)-D740-F740))","v":1},"2015/02","",0.5]
["DEREPPE Bruno","2015-02-09","2015-03-16",0,"2015-03-20",0,"CP","Acceptée",{"$f":"IF(OR(G741=\"Convention\",H741=\"Refusée\"),0,IF(H741=\"Annulée\",-(NETWORKDAYS.INTL(C741,E741,1,JFERIES)-D741-F741),NETWORKDAYS.INTL(C741,E741,1,JFERIES)-D741-F741))","v":5},"2015/03","",3.9600000000000009]
["SIODMAK Eric","2015-02-09","2015-02-23",0,"2015-02-27",0,"CP","Acceptée",{"$f":"IF(OR(G742=\"Convention\",H742=\"Refusée\"),0,IF(H742=\"Annulée\",-(NETWORKDAYS.INTL(C742,E742,1,JFERIES)-D742-F742),NETWORKDAYS.INTL(C742,E742,1,JFERIES)-D742-F742))","v":5},"2015/02","",5.9600000000000009]
["SIODMAK Eric","2015-02-09","2015-04-27",0,"2015-05-01",0,"CP","Acceptée",{"$f":"IF(OR(G743=\"Convention\",H743=\"Refusée\"),0,IF(H743=\"Annulée\",-(NETWORKDAYS.INTL(C743,E743,1,JFERIES)-D743-F743),NETWORKDAYS.INTL(C743,E743,1,JFERIES)-D743-F743))","v":4},"2015/05","",7.96]
["GUERIN Viviane","2015-02-10","2015-02-16",0,"2015-02-16",0,"RTT","Acceptée",{"$f":"IF(OR(G744=\"Convention\",H744=\"Refusée\"),0,IF(H744=\"Annulée\",-(NETWORKDAYS.INTL(C744,E744,1,JFERIES)-D744-F744),NETWORKDAYS.INTL(C744,E744,1,JFERIES)-D744-F744))","v":1},"2015/02","",0]
["GUERIN Viviane","2015-02-10","2015-05-04",0,"2015-05-07",0,"CP","Acceptée",{"$f":"IF(OR(G745=\"Convention\",H745=\"Refusée\"),0,IF(H745=\"Annulée\",-(NETWORKDAYS.INTL(C745,E745,1,JFERIES)-D745-F745),NETWORKDAYS.INTL(C745,E745,1,JFERIES)-D745-F745))","v":4},"2015/05","",6.9600000000000009]
["GUIOT Fabien","2015-02-11","2015-02-23",0,"2015-02-23",0,"RTT","Acceptée",{"$f":"IF(OR(G746=\"Convention\",H746=\"Refusée\"),0,IF(H746=\"Annulée\",-(NETWORKDAYS.INTL(C746,E746,1,JFERIES)-D746-F746),NETWORKDAYS.INTL(C746,E746,1,JFERIES)-D746-F746))","v":1},"2015/02","",0]
["ROBIN Kevin","2015-02-12","2015-02-23",0,"2015-02-23",0,"CP","Acceptée",{"$f":"IF(OR(G747=\"Convention\",H747=\"Refusée\"),0,IF(H747=\"Annulée\",-(NETWORKDAYS.INTL(C747,E747,1,JFERIES)-D747-F747),NETWORKDAYS.INTL(C747,E747,1,JFERIES)-D747-F747))","v":1},"2015/02","",-6.0399999999999991]
["POMMERELL Patrick","2015-02-16","2015-02-24",0,"2015-02-25",0,"CP","Acceptée",{"$f":"IF(OR(G748=\"Convention\",H748=\"Refusée\"),0,IF(H748=\"Annulée\",-(NETWORKDAYS.INTL(C748,E748,1,JFERIES)-D748-F748),NETWORKDAYS.INTL(C748,E748,1,JFERIES)-D748-F748))","v":2},"2015/02","",6.4600000000000009]
["KADEM Christophe","2015-02-17","2015-03-25",0,"2015-03-25",0,"RTT","Acceptée",{"$f":"IF(OR(G749=\"Convention\",H749=\"Refusée\"),0,IF(H749=\"Annulée\",-(NETWORKDAYS.INTL(C749,E749,1,JFERIES)-D749-F749),NETWORKDAYS.INTL(C749,E749,1,JFERIES)-D749-F749))","v":1},"2015/03","",-0.5]
["KADEM Christophe","2015-02-17","2015-05-04",0,"2015-05-07",0,"CP","Acceptée",{"$f":"IF(OR(G750=\"Convention\",H750=\"Refusée\"),0,IF(H750=\"Annulée\",-(NETWORKDAYS.INTL(C750,E750,1,JFERIES)-D750-F750),NETWORKDAYS.INTL(C750,E750,1,JFERIES)-D750-F750))","v":4},"2015/05","",1.4600000000000009]
["KADEM Christophe","2015-02-17","2015-05-29",0.5,"2015-05-29",0,"CP","Acceptée",{"$f":"IF(OR(G751=\"Convention\",H751=\"Refusée\"),0,IF(H751=\"Annulée\",-(NETWORKDAYS.INTL(C751,E751,1,JFERIES)-D751-F751),NETWORKDAYS.INTL(C751,E751,1,JFERIES)-D751-F751))","v":0.5},"2015/05","",4.9600000000000009]
["KADEM Christophe","2015-02-17","2015-07-27",0,"2015-07-31",0,"CP","Acceptée",{"$f":"IF(OR(G752=\"Convention\",H752=\"Refusée\"),0,IF(H752=\"Annulée\",-(NETWORKDAYS.INTL(C752,E752,1,JFERIES)-D752-F752),NETWORKDAYS.INTL(C752,E752,1,JFERIES)-D752-F752))","v":5},"2015/07","Congés eté 2015",-9.5399999999999991]
["KADEM Christophe","2015-02-17","2015-08-01",0,"2015-08-16",0,"CP","Acceptée",{"$f":"IF(OR(G753=\"Convention\",H753=\"Refusée\"),0,IF(H753=\"Annulée\",-(NETWORKDAYS.INTL(C753,E753,1,JFERIES)-D753-F753),NETWORKDAYS.INTL(C753,E753,1,JFERIES)-D753-F753))","v":10},"2015/08","Congés eté 2016"]
["HAUTEBRANC Alexis","2015-02-18","2015-03-25",0.5,"2015-03-25",0,"CP","Acceptée",{"$f":"IF(OR(G754=\"Convention\",H754=\"Refusée\"),0,IF(H754=\"Annulée\",-(NETWORKDAYS.INTL(C754,E754,1,JFERIES)-D754-F754),NETWORKDAYS.INTL(C754,E754,1,JFERIES)-D754-F754))","v":0.5},"2015/03","",4.9600000000000009]
["HAUTEBRANC Alexis","2015-02-18","2015-03-26",0,"2015-03-27",0,"CP","Acceptée",{"$f":"IF(OR(G755=\"Convention\",H755=\"Refusée\"),0,IF(H755=\"Annulée\",-(NETWORKDAYS.INTL(C755,E755,1,JFERIES)-D755-F755),NETWORKDAYS.INTL(C755,E755,1,JFERIES)-D755-F755))","v":2},"2015/03","",3.4600000000000009]
["LEDANT Charles","2015-02-18","2015-03-05",0,"2015-03-05",0,"CP","Acceptée",{"$f":"IF(OR(G756=\"Convention\",H756=\"Refusée\"),0,IF(H756=\"Annulée\",-(NETWORKDAYS.INTL(C756,E756,1,JFERIES)-D756-F756),NETWORKDAYS.INTL(C756,E756,1,JFERIES)-D756-F756))","v":1},"2015/03","",7.9600000000000009]
["LEDANT Charles","2015-02-18","2015-03-13",0,"2015-03-13",0,"CP","Acceptée",{"$f":"IF(OR(G757=\"Convention\",H757=\"Refusée\"),0,IF(H757=\"Annulée\",-(NETWORKDAYS.INTL(C757,E757,1,JFERIES)-D757-F757),NETWORKDAYS.INTL(C757,E757,1,JFERIES)-D757-F757))","v":1},"2015/03","",7.9600000000000009]
["LEDANT Charles","2015-02-18","2015-03-23",0,"2015-03-23",0,"CP","Acceptée",{"$f":"IF(OR(G758=\"Convention\",H758=\"Refusée\"),0,IF(H758=\"Annulée\",-(NETWORKDAYS.INTL(C758,E758,1,JFERIES)-D758-F758),NETWORKDAYS.INTL(C758,E758,1,JFERIES)-D758-F758))","v":1},"2015/03","",7.9600000000000009]
["LEDANT Charles","2015-02-18","2015-04-20",0,"2015-04-20",0,"RTT","Acceptée",{"$f":"IF(OR(G759=\"Convention\",H759=\"Refusée\"),0,IF(H759=\"Annulée\",-(NETWORKDAYS.INTL(C759,E759,1,JFERIES)-D759-F759),NETWORKDAYS.INTL(C759,E759,1,JFERIES)-D759-F759))","v":1},"2015/04","",0.5]
["LEDANT Charles","2015-02-18","2015-05-04",0,"2015-05-07",0,"CP","Acceptée",{"$f":"IF(OR(G760=\"Convention\",H760=\"Refusée\"),0,IF(H760=\"Annulée\",-(NETWORKDAYS.INTL(C760,E760,1,JFERIES)-D760-F760),NETWORKDAYS.INTL(C760,E760,1,JFERIES)-D760-F760))","v":4},"2015/05","",4.9600000000000009]
["LEDANT Charles","2015-02-18","2015-05-15",0,"2015-05-15",0,"CP","Acceptée",{"$f":"IF(OR(G761=\"Convention\",H761=\"Refusée\"),0,IF(H761=\"Annulée\",-(NETWORKDAYS.INTL(C761,E761,1,JFERIES)-D761-F761),NETWORKDAYS.INTL(C761,E761,1,JFERIES)-D761-F761))","v":1},"2015/05","",7.9600000000000009]
["MARAIS Bernard","2015-02-19","2015-08-03",0,"2015-08-07",0,"CP","Acceptée",{"$f":"IF(OR(G762=\"Convention\",H762=\"Refusée\"),0,IF(H762=\"Annulée\",-(NETWORKDAYS.INTL(C762,E762,1,JFERIES)-D762-F762),NETWORKDAYS.INTL(C762,E762,1,JFERIES)-D762-F762))","v":5},"2015/08","Congés eté 2015",-2.0399999999999991]
["DREZET Olivier","2015-02-25","2015-02-27",0,"2015-02-27",0,"RTT","Acceptée",{"$f":"IF(OR(G763=\"Convention\",H763=\"Refusée\"),0,IF(H763=\"Annulée\",-(NETWORKDAYS.INTL(C763,E763,1,JFERIES)-D763-F763),NETWORKDAYS.INTL(C763,E763,1,JFERIES)-D763-F763))","v":1},"2015/02","",0.5]
["VAUTRAIN Franck","2015-02-26","2015-03-04",0.5,"2015-03-04",0,"RTT","Acceptée",{"$f":"IF(OR(G764=\"Convention\",H764=\"Refusée\"),0,IF(H764=\"Annulée\",-(NETWORKDAYS.INTL(C764,E764,1,JFERIES)-D764-F764),NETWORKDAYS.INTL(C764,E764,1,JFERIES)-D764-F764))","v":0.5},"2015/03","",1]
["LOCATELLI Bruno","2015-02-26","2015-07-27",0,"2015-07-31",0,"CP","Acceptée",{"$f":"IF(OR(G765=\"Convention\",H765=\"Refusée\"),0,IF(H765=\"Annulée\",-(NETWORKDAYS.INTL(C765,E765,1,JFERIES)-D765-F765),NETWORKDAYS.INTL(C765,E765,1,JFERIES)-D765-F765))","v":5},"2015/07","Congés eté 2015",0.96000000000000085]
["LOCATELLI Bruno","2015-02-26","2015-08-24",0,"2015-08-31",0,"CP","Acceptée",{"$f":"IF(OR(G766=\"Convention\",H766=\"Refusée\"),0,IF(H766=\"Annulée\",-(NETWORKDAYS.INTL(C766,E766,1,JFERIES)-D766-F766),NETWORKDAYS.INTL(C766,E766,1,JFERIES)-D766-F766))","v":6},"2015/08","Congés eté 2015",-6.0399999999999991]
["LOCATELLI Bruno","2015-02-26","2015-09-01",0,"2015-09-08",0,"CP","Acceptée",{"$f":"IF(OR(G767=\"Convention\",H767=\"Refusée\"),0,IF(H767=\"Annulée\",-(NETWORKDAYS.INTL(C767,E767,1,JFERIES)-D767-F767),NETWORKDAYS.INTL(C767,E767,1,JFERIES)-D767-F767))","v":6},"2015/09","Congés eté 2016"]
["GUERIN Viviane","2015-02-27","2015-07-13",0,"2015-07-13",0,"CP","Acceptée",{"$f":"IF(OR(G768=\"Convention\",H768=\"Refusée\"),0,IF(H768=\"Annulée\",-(NETWORKDAYS.INTL(C768,E768,1,JFERIES)-D768-F768),NETWORKDAYS.INTL(C768,E768,1,JFERIES)-D768-F768))","v":1},"2015/07","",5.9600000000000009]
["SOUCHET Alain","2015-03-03","2015-05-04",0,"2015-05-07",0,"CP","Acceptée",{"$f":"IF(OR(G769=\"Convention\",H769=\"Refusée\"),0,IF(H769=\"Annulée\",-(NETWORKDAYS.INTL(C769,E769,1,JFERIES)-D769-F769),NETWORKDAYS.INTL(C769,E769,1,JFERIES)-D769-F769))","v":4},"2015/05","",6.4600000000000009]
["GUIOT Fabien","2015-03-03","2015-04-27",0,"2015-04-30",0,"CP","Acceptée",{"$f":"IF(OR(G770=\"Convention\",H770=\"Refusée\"),0,IF(H770=\"Annulée\",-(NETWORKDAYS.INTL(C770,E770,1,JFERIES)-D770-F770),NETWORKDAYS.INTL(C770,E770,1,JFERIES)-D770-F770))","v":4},"2015/04","",4.9600000000000009]
["GUIOT Fabien","2015-03-03","2015-05-11",0,"2015-05-15",0,"CP","Acceptée",{"$f":"IF(OR(G771=\"Convention\",H771=\"Refusée\"),0,IF(H771=\"Annulée\",-(NETWORKDAYS.INTL(C771,E771,1,JFERIES)-D771-F771),NETWORKDAYS.INTL(C771,E771,1,JFERIES)-D771-F771))","v":4},"2015/05","",4.9600000000000009]
["GUERIN Viviane","2015-03-04","2015-07-15",0,"2015-07-15",0,"RTT","Acceptée",{"$f":"IF(OR(G772=\"Convention\",H772=\"Refusée\"),0,IF(H772=\"Annulée\",-(NETWORKDAYS.INTL(C772,E772,1,JFERIES)-D772-F772),NETWORKDAYS.INTL(C772,E772,1,JFERIES)-D772-F772))","v":1},"2015/07","",-0.5]
["SANTUCCI Lionel","2015-03-05","2015-03-30",0,"2015-03-31",0,"CP","Acceptée",{"$f":"IF(OR(G773=\"Convention\",H773=\"Refusée\"),0,IF(H773=\"Annulée\",-(NETWORKDAYS.INTL(C773,E773,1,JFERIES)-D773-F773),NETWORKDAYS.INTL(C773,E773,1,JFERIES)-D773-F773))","v":2},"2015/03","",11]
["SANTUCCI Lionel","2015-03-05","2015-04-01",0,"2015-04-03",0,"CP","Acceptée",{"$f":"IF(OR(G774=\"Convention\",H774=\"Refusée\"),0,IF(H774=\"Annulée\",-(NETWORKDAYS.INTL(C774,E774,1,JFERIES)-D774-F774),NETWORKDAYS.INTL(C774,E774,1,JFERIES)-D774-F774))","v":3},"2015/04",null,8]
["COUTANT Jean Paul","2015-03-05","2015-03-11",0,"2015-03-11",0,"RTT","Acceptée",{"$f":"IF(OR(G775=\"Convention\",H775=\"Refusée\"),0,IF(H775=\"Annulée\",-(NETWORKDAYS.INTL(C775,E775,1,JFERIES)-D775-F775),NETWORKDAYS.INTL(C775,E775,1,JFERIES)-D775-F775))","v":1},"2015/03","",1.5]
["COUTANT Jean Paul","2015-03-05","2015-03-25",0,"2015-03-25",0,"RTT","Acceptée",{"$f":"IF(OR(G776=\"Convention\",H776=\"Refusée\"),0,IF(H776=\"Annulée\",-(NETWORKDAYS.INTL(C776,E776,1,JFERIES)-D776-F776),NETWORKDAYS.INTL(C776,E776,1,JFERIES)-D776-F776))","v":1},"2015/03","",1.5]
["GIRAUDON Alain","2015-03-05","2015-03-06",0.5,"2015-03-06",0,"RTT","Acceptée",{"$f":"IF(OR(G777=\"Convention\",H777=\"Refusée\"),0,IF(H777=\"Annulée\",-(NETWORKDAYS.INTL(C777,E777,1,JFERIES)-D777-F777),NETWORKDAYS.INTL(C777,E777,1,JFERIES)-D777-F777))","v":0.5},"2015/03","",1.5]
["GUINOT Nathalie","2015-03-06","2015-04-29",0,"2015-04-30",0,"CP","Acceptée",{"$f":"IF(OR(G778=\"Convention\",H778=\"Refusée\"),0,IF(H778=\"Annulée\",-(NETWORKDAYS.INTL(C778,E778,1,JFERIES)-D778-F778),NETWORKDAYS.INTL(C778,E778,1,JFERIES)-D778-F778))","v":2},"2015/04","",8.9600000000000009]
["HEMLER Christelle","2015-03-09","2015-03-12",0,"2015-03-12",0,"CP","Acceptée",{"$f":"IF(OR(G779=\"Convention\",H779=\"Refusée\"),0,IF(H779=\"Annulée\",-(NETWORKDAYS.INTL(C779,E779,1,JFERIES)-D779-F779),NETWORKDAYS.INTL(C779,E779,1,JFERIES)-D779-F779))","v":1},"2015/03","",1]
["KADEM Christophe","2015-03-09","2015-03-18",0,"2015-03-18",0,"RTT","Acceptée",{"$f":"IF(OR(G780=\"Convention\",H780=\"Refusée\"),0,IF(H780=\"Annulée\",-(NETWORKDAYS.INTL(C780,E780,1,JFERIES)-D780-F780),NETWORKDAYS.INTL(C780,E780,1,JFERIES)-D780-F780))","v":1},"2015/03","",-0.5]
["ROBIN Kevin","2015-03-09","2015-03-23",0,"2015-03-23",0,"CP","Acceptée",{"$f":"IF(OR(G781=\"Convention\",H781=\"Refusée\"),0,IF(H781=\"Annulée\",-(NETWORKDAYS.INTL(C781,E781,1,JFERIES)-D781-F781),NETWORKDAYS.INTL(C781,E781,1,JFERIES)-D781-F781))","v":1},"2015/03","",-7.0399999999999991]
["TAQUET Alain","2015-03-09","2015-05-04",0,"2015-05-07",0,"CP","Acceptée",{"$f":"IF(OR(G782=\"Convention\",H782=\"Refusée\"),0,IF(H782=\"Annulée\",-(NETWORKDAYS.INTL(C782,E782,1,JFERIES)-D782-F782),NETWORKDAYS.INTL(C782,E782,1,JFERIES)-D782-F782))","v":4},"2015/05","",3.9600000000000009]
["DREZET Olivier","2015-03-10","2015-03-23",0,"2015-03-23",0,"RTT","Acceptée",{"$f":"IF(OR(G783=\"Convention\",H783=\"Refusée\"),0,IF(H783=\"Annulée\",-(NETWORKDAYS.INTL(C783,E783,1,JFERIES)-D783-F783),NETWORKDAYS.INTL(C783,E783,1,JFERIES)-D783-F783))","v":1},"2015/03","",0.5]
["BERTHE Magali","2015-03-11","2015-07-13",0,"2015-07-13",0,"CP","Acceptée",{"$f":"IF(OR(G784=\"Convention\",H784=\"Refusée\"),0,IF(H784=\"Annulée\",-(NETWORKDAYS.INTL(C784,E784,1,JFERIES)-D784-F784),NETWORKDAYS.INTL(C784,E784,1,JFERIES)-D784-F784))","v":1},"2015/07","",-8.43]
["POMMERELL Patrick","2015-03-12","2015-03-26",0.5,"2015-03-26",0,"RTT","Acceptée",{"$f":"IF(OR(G785=\"Convention\",H785=\"Refusée\"),0,IF(H785=\"Annulée\",-(NETWORKDAYS.INTL(C785,E785,1,JFERIES)-D785-F785),NETWORKDAYS.INTL(C785,E785,1,JFERIES)-D785-F785))","v":0.5},"2015/03","Convocation tribunal",2.5]
["MARZOUK Sami","2015-03-12","2015-04-21",0,"2015-04-30",0,"CP","Acceptée",{"$f":"IF(OR(G786=\"Convention\",H786=\"Refusée\"),0,IF(H786=\"Annulée\",-(NETWORKDAYS.INTL(C786,E786,1,JFERIES)-D786-F786),NETWORKDAYS.INTL(C786,E786,1,JFERIES)-D786-F786))","v":8},"2015/04","",-3.9999999999999147E-2]
["COUTANT Jean Paul","2015-03-13","2015-04-20",0,"2015-04-24",0,"CP","Acceptée",{"$f":"IF(OR(G787=\"Convention\",H787=\"Refusée\"),0,IF(H787=\"Annulée\",-(NETWORKDAYS.INTL(C787,E787,1,JFERIES)-D787-F787),NETWORKDAYS.INTL(C787,E787,1,JFERIES)-D787-F787))","v":5},"2015/04","",7.9600000000000009]
["DREZET Olivier","2015-03-16","2015-03-17",0,"2015-03-17",0.5,"RTT","Acceptée",{"$f":"IF(OR(G788=\"Convention\",H788=\"Refusée\"),0,IF(H788=\"Annulée\",-(NETWORKDAYS.INTL(C788,E788,1,JFERIES)-D788-F788),NETWORKDAYS.INTL(C788,E788,1,JFERIES)-D788-F788))","v":0.5},"2015/03","",0]
["DREZET Olivier","2015-03-16","2015-06-18",0,"2015-06-19",0,"CP","Acceptée",{"$f":"IF(OR(G789=\"Convention\",H789=\"Refusée\"),0,IF(H789=\"Annulée\",-(NETWORKDAYS.INTL(C789,E789,1,JFERIES)-D789-F789),NETWORKDAYS.INTL(C789,E789,1,JFERIES)-D789-F789))","v":2},"2015/06","",2.4600000000000009]
["VAUTRAIN Franck","2015-03-16","2015-08-03",0,"2015-08-24",0,"CP","Acceptée",{"$f":"IF(OR(G790=\"Convention\",H790=\"Refusée\"),0,IF(H790=\"Annulée\",-(NETWORKDAYS.INTL(C790,E790,1,JFERIES)-D790-F790),NETWORKDAYS.INTL(C790,E790,1,JFERIES)-D790-F790))","v":16},"2015/08","Congés eté 2015",-6.0399999999999991]
["SANTUCCI Lionel","2015-03-16","2015-07-27",0,"2015-08-13",0,"CP","Acceptée",{"$f":"IF(OR(G791=\"Convention\",H791=\"Refusée\"),0,IF(H791=\"Annulée\",-(NETWORKDAYS.INTL(C791,E791,1,JFERIES)-D791-F791),NETWORKDAYS.INTL(C791,E791,1,JFERIES)-D791-F791))","v":14},"2015/07","Congés eté 2015",-6.0399999999999991]
["MARAIS Bernard","2015-03-17","2015-05-15",0,"2015-05-15",0,"CP","Acceptée",{"$f":"IF(OR(G792=\"Convention\",H792=\"Refusée\"),0,IF(H792=\"Annulée\",-(NETWORKDAYS.INTL(C792,E792,1,JFERIES)-D792-F792),NETWORKDAYS.INTL(C792,E792,1,JFERIES)-D792-F792))","v":1},"2015/05","",1.9600000000000009]
["MARAIS Bernard","2015-03-17","2015-06-12",0,"2015-06-16",0,"CP","Acceptée",{"$f":"IF(OR(G793=\"Convention\",H793=\"Refusée\"),0,IF(H793=\"Annulée\",-(NETWORKDAYS.INTL(C793,E793,1,JFERIES)-D793-F793),NETWORKDAYS.INTL(C793,E793,1,JFERIES)-D793-F793))","v":3},"2015/06","",-3.9999999999999147E-2]
["HEMLER Christelle","2015-03-18","2015-03-23",0,"2015-03-23",0,"CP","Acceptée",{"$f":"IF(OR(G794=\"Convention\",H794=\"Refusée\"),0,IF(H794=\"Annulée\",-(NETWORKDAYS.INTL(C794,E794,1,JFERIES)-D794-F794),NETWORKDAYS.INTL(C794,E794,1,JFERIES)-D794-F794))","v":1},"2015/03","",8.4600000000000009]
["HAUTEBRANC Alexis","2015-03-19","2015-05-15",0,"2015-05-15",0,"CP","Acceptée",{"$f":"IF(OR(G795=\"Convention\",H795=\"Refusée\"),0,IF(H795=\"Annulée\",-(NETWORKDAYS.INTL(C795,E795,1,JFERIES)-D795-F795),NETWORKDAYS.INTL(C795,E795,1,JFERIES)-D795-F795))","v":1},"2015/05","",1.9600000000000009]
["LEDANT Charles","2015-03-20","2015-04-13",0,"2015-04-13",0,"CP","Demande",{"$f":"IF(OR(G796=\"Convention\",H796=\"Refusée\"),0,IF(H796=\"Annulée\",-(NETWORKDAYS.INTL(C796,E796,1,JFERIES)-D796-F796),NETWORKDAYS.INTL(C796,E796,1,JFERIES)-D796-F796))","v":1},"2015/04","",-3.9999999999999147E-2]
["LEDANT Charles","2015-03-20","2015-07-03",0,"2015-07-03",0,"Convention","Acceptée",{"$f":"IF(OR(G797=\"Convention\",H797=\"Refusée\"),0,IF(H797=\"Annulée\",-(NETWORKDAYS.INTL(C797,E797,1,JFERIES)-D797-F797),NETWORKDAYS.INTL(C797,E797,1,JFERIES)-D797-F797))","v":0},"2015/07","Mariage Fils",-3.9999999999999147E-2]
["LEDANT Charles","2015-03-20","2015-07-06",0,"2015-07-06",0,"CP","Acceptée",{"$f":"IF(OR(G798=\"Convention\",H798=\"Refusée\"),0,IF(H798=\"Annulée\",-(NETWORKDAYS.INTL(C798,E798,1,JFERIES)-D798-F798),NETWORKDAYS.INTL(C798,E798,1,JFERIES)-D798-F798))","v":1},"2015/07","",-3.9999999999999147E-2]
["VAUTRAIN Franck","2015-03-23","2015-03-26",0.5,"2015-03-26",0,"RTT","Acceptée",{"$f":"IF(OR(G799=\"Convention\",H799=\"Refusée\"),0,IF(H799=\"Annulée\",-(NETWORKDAYS.INTL(C799,E799,1,JFERIES)-D799-F799),NETWORKDAYS.INTL(C799,E799,1,JFERIES)-D799-F799))","v":0.5},"2015/03","",1.5]
["SIODMAK Eric","2015-03-23","2015-03-25",0,"2015-03-25",0,"RTT","Annulée",{"$f":"IF(OR(G800=\"Convention\",H800=\"Refusée\"),0,IF(H800=\"Annulée\",-(NETWORKDAYS.INTL(C800,E800,1,JFERIES)-D800-F800),NETWORKDAYS.INTL(C800,E800,1,JFERIES)-D800-F800))","v":-1},"2015/03","Arret maladie",0.5]
["SIODMAK Eric","2015-03-23","2015-03-30",0,"2015-03-30",0,"CP","Annulée",{"$f":"IF(OR(G801=\"Convention\",H801=\"Refusée\"),0,IF(H801=\"Annulée\",-(NETWORKDAYS.INTL(C801,E801,1,JFERIES)-D801-F801),NETWORKDAYS.INTL(C801,E801,1,JFERIES)-D801-F801))","v":-1},"2015/03","Arret maladie",0.96000000000000085]
["GUERIN Viviane","2015-03-24","2015-05-22",0,"2015-05-22",0,"CP","Acceptée",{"$f":"IF(OR(G802=\"Convention\",H802=\"Refusée\"),0,IF(H802=\"Annulée\",-(NETWORKDAYS.INTL(C802,E802,1,JFERIES)-D802-F802),NETWORKDAYS.INTL(C802,E802,1,JFERIES)-D802-F802))","v":1},"2015/05","",5.9600000000000009]
["LEDANT Charles","2015-03-24","2015-08-03",0,"2015-08-26",0,"CP","Acceptée",{"$f":"IF(OR(G803=\"Convention\",H803=\"Refusée\"),0,IF(H803=\"Annulée\",-(NETWORKDAYS.INTL(C803,E803,1,JFERIES)-D803-F803),NETWORKDAYS.INTL(C803,E803,1,JFERIES)-D803-F803))","v":18},"2015/08","Congés eté 2015",-18.04]
["GUERIN Viviane","2015-03-24","2015-08-17",0,"2015-08-31",0,"CP","Acceptée",{"$f":"IF(OR(G804=\"Convention\",H804=\"Refusée\"),0,IF(H804=\"Annulée\",-(NETWORKDAYS.INTL(C804,E804,1,JFERIES)-D804-F804),NETWORKDAYS.INTL(C804,E804,1,JFERIES)-D804-F804))","v":11},"2015/08","Congés eté 2015",-8.0399999999999991]
["GUERIN Viviane","2015-03-24","2015-09-01",0,"2015-09-04",0,"CP","Acceptée",{"$f":"IF(OR(G805=\"Convention\",H805=\"Refusée\"),0,IF(H805=\"Annulée\",-(NETWORKDAYS.INTL(C805,E805,1,JFERIES)-D805-F805),NETWORKDAYS.INTL(C805,E805,1,JFERIES)-D805-F805))","v":4},"2015/09","Congés eté 2015"]
["POMMERELL Patrick","2015-03-25","2015-08-03",0,"2015-08-21",0,"CP","Acceptée",{"$f":"IF(OR(G806=\"Convention\",H806=\"Refusée\"),0,IF(H806=\"Annulée\",-(NETWORKDAYS.INTL(C806,E806,1,JFERIES)-D806-F806),NETWORKDAYS.INTL(C806,E806,1,JFERIES)-D806-F806))","v":15},"2015/08","Congés eté 2015",-8.5399999999999991]
["SOUCHET Alain","2015-03-25","2015-04-13",0,"2015-04-13",0.5,"CP","Acceptée",{"$f":"IF(OR(G807=\"Convention\",H807=\"Refusée\"),0,IF(H807=\"Annulée\",-(NETWORKDAYS.INTL(C807,E807,1,JFERIES)-D807-F807),NETWORKDAYS.INTL(C807,E807,1,JFERIES)-D807-F807))","v":0.5},"2015/04","",5.9600000000000009]
["SOUCHET Alain","2015-03-25","2015-05-13",0,"2015-05-18",0,"CP","Acceptée",{"$f":"IF(OR(G808=\"Convention\",H808=\"Refusée\"),0,IF(H808=\"Annulée\",-(NETWORKDAYS.INTL(C808,E808,1,JFERIES)-D808-F808),NETWORKDAYS.INTL(C808,E808,1,JFERIES)-D808-F808))","v":3},"2015/05","",3.4600000000000009]
["SOUCHET Alain","2015-03-25","2015-04-20",0,"2015-04-20",0,"CP","Acceptée",{"$f":"IF(OR(G809=\"Convention\",H809=\"Refusée\"),0,IF(H809=\"Annulée\",-(NETWORKDAYS.INTL(C809,E809,1,JFERIES)-D809-F809),NETWORKDAYS.INTL(C809,E809,1,JFERIES)-D809-F809))","v":1},"2015/04","",5.4600000000000009]
["SOUCHET Alain","2015-03-25","2015-04-30",0,"2015-04-30",0,"CP","Acceptée",{"$f":"IF(OR(G810=\"Convention\",H810=\"Refusée\"),0,IF(H810=\"Annulée\",-(NETWORKDAYS.INTL(C810,E810,1,JFERIES)-D810-F810),NETWORKDAYS.INTL(C810,E810,1,JFERIES)-D810-F810))","v":1},"2015/04","",5.4600000000000009]
["VAUTRAIN Franck","2015-03-27","2015-04-10",0.5,"2015-04-10",0,"RTT","Acceptée",{"$f":"IF(OR(G811=\"Convention\",H811=\"Refusée\"),0,IF(H811=\"Annulée\",-(NETWORKDAYS.INTL(C811,E811,1,JFERIES)-D811-F811),NETWORKDAYS.INTL(C811,E811,1,JFERIES)-D811-F811))","v":0.5},"2015/04","",1]
["ROBIN Kevin","2015-03-27","2015-04-17",0.5,"2015-04-20",0,"CP","Acceptée",{"$f":"IF(OR(G812=\"Convention\",H812=\"Refusée\"),0,IF(H812=\"Annulée\",-(NETWORKDAYS.INTL(C812,E812,1,JFERIES)-D812-F812),NETWORKDAYS.INTL(C812,E812,1,JFERIES)-D812-F812))","v":1.5},"2015/04","",-8.5399999999999991]
["COUTANT Jean Paul","2015-03-27","2015-03-27",0,"2015-03-27",0,"CP","Acceptée",{"$f":"IF(OR(G813=\"Convention\",H813=\"Refusée\"),0,IF(H813=\"Annulée\",-(NETWORKDAYS.INTL(C813,E813,1,JFERIES)-D813-F813),NETWORKDAYS.INTL(C813,E813,1,JFERIES)-D813-F813))","v":1},"2015/03","",6.9600000000000009]
["VAUTRAIN Franck","2015-03-30","2015-04-13",0,"2015-04-17",0,"CP","Acceptée",{"$f":"IF(OR(G814=\"Convention\",H814=\"Refusée\"),0,IF(H814=\"Annulée\",-(NETWORKDAYS.INTL(C814,E814,1,JFERIES)-D814-F814),NETWORKDAYS.INTL(C814,E814,1,JFERIES)-D814-F814))","v":5},"2015/04","",4.9600000000000009]
["POMMERELL Patrick","2015-03-30","2015-04-15",0,"2015-04-15",0.5,"RTT","Acceptée",{"$f":"IF(OR(G815=\"Convention\",H815=\"Refusée\"),0,IF(H815=\"Annulée\",-(NETWORKDAYS.INTL(C815,E815,1,JFERIES)-D815-F815),NETWORKDAYS.INTL(C815,E815,1,JFERIES)-D815-F815))","v":0.5},"2015/04","Opération chirurg. Swann",2]
["HAUTEBRANC Alexis","2015-04-01","2015-06-01",0,"2015-06-01",0,"CP","Acceptée",{"$f":"IF(OR(G816=\"Convention\",H816=\"Refusée\"),0,IF(H816=\"Annulée\",-(NETWORKDAYS.INTL(C816,E816,1,JFERIES)-D816-F816),NETWORKDAYS.INTL(C816,E816,1,JFERIES)-D816-F816))","v":1},"2015/06","",0.96000000000000085]
["HAUTEBRANC Alexis","2015-04-09","2015-08-24",0,"2015-08-31",0,"CP","Acceptée",{"$f":"IF(OR(G817=\"Convention\",H817=\"Refusée\"),0,IF(H817=\"Annulée\",-(NETWORKDAYS.INTL(C817,E817,1,JFERIES)-D817-F817),NETWORKDAYS.INTL(C817,E817,1,JFERIES)-D817-F817))","v":6},"2015/08","Congés eté 2015",-9.0399999999999991]
["HAUTEBRANC Alexis","2015-04-09","2015-09-01",0,"2015-09-07",0,"CP","Acceptée",{"$f":"IF(OR(G818=\"Convention\",H818=\"Refusée\"),0,IF(H818=\"Annulée\",-(NETWORKDAYS.INTL(C818,E818,1,JFERIES)-D818-F818),NETWORKDAYS.INTL(C818,E818,1,JFERIES)-D818-F818))","v":5},"2015/09","Congés eté 2015"]
["CHEVALIER Yohan","2015-04-09","2015-05-15",0,"2015-05-15",0,"CP","Acceptée",{"$f":"IF(OR(G819=\"Convention\",H819=\"Refusée\"),0,IF(H819=\"Annulée\",-(NETWORKDAYS.INTL(C819,E819,1,JFERIES)-D819-F819),NETWORKDAYS.INTL(C819,E819,1,JFERIES)-D819-F819))","v":1},"2015/05","",-7.4399999999999995]
["CHEVALIER Yohan","2015-04-09","2015-08-24",0,"2015-08-31",0,"CP","Acceptée",{"$f":"IF(OR(G820=\"Convention\",H820=\"Refusée\"),0,IF(H820=\"Annulée\",-(NETWORKDAYS.INTL(C820,E820,1,JFERIES)-D820-F820),NETWORKDAYS.INTL(C820,E820,1,JFERIES)-D820-F820))","v":6},"2015/08","Congés eté 2015"]
["CHEVALIER Yohan","2015-04-09","2015-09-01",0,"2015-09-07",0,"CP","Acceptée",{"$f":"IF(OR(G821=\"Convention\",H821=\"Refusée\"),0,IF(H821=\"Annulée\",-(NETWORKDAYS.INTL(C821,E821,1,JFERIES)-D821-F821),NETWORKDAYS.INTL(C821,E821,1,JFERIES)-D821-F821))","v":5},"2015/09","Congés eté 2015"]
["HAUTEBRANC Alexis","2015-04-14","2015-05-22",0,"2015-05-22",0,"CP","Acceptée",{"$f":"IF(OR(G822=\"Convention\",H822=\"Refusée\"),0,IF(H822=\"Annulée\",-(NETWORKDAYS.INTL(C822,E822,1,JFERIES)-D822-F822),NETWORKDAYS.INTL(C822,E822,1,JFERIES)-D822-F822))","v":1},"2015/05","",0.96000000000000085]
["LOCATELLI Bruno","2015-04-14","2015-04-20",0,"2015-04-20",0,"CP","Acceptée",{"$f":"IF(OR(G823=\"Convention\",H823=\"Refusée\"),0,IF(H823=\"Annulée\",-(NETWORKDAYS.INTL(C823,E823,1,JFERIES)-D823-F823),NETWORKDAYS.INTL(C823,E823,1,JFERIES)-D823-F823))","v":1},"2015/04","",4.9600000000000009]
["GUERIN Viviane","2015-04-14","2015-09-07",0,"2015-09-07",0,"RTD Recup","Acceptée",{"$f":"IF(OR(G824=\"Convention\",H824=\"Refusée\"),0,IF(H824=\"Annulée\",-(NETWORKDAYS.INTL(C824,E824,1,JFERIES)-D824-F824),NETWORKDAYS.INTL(C824,E824,1,JFERIES)-D824-F824))","v":1},"2015/09","",""]
["DREVON Alain","2015-04-16","2015-04-17",0,"2015-04-17",0.5,"RTT","Acceptée",{"$f":"IF(OR(G825=\"Convention\",H825=\"Refusée\"),0,IF(H825=\"Annulée\",-(NETWORKDAYS.INTL(C825,E825,1,JFERIES)-D825-F825),NETWORKDAYS.INTL(C825,E825,1,JFERIES)-D825-F825))","v":0.5},"2015/04","",2.5]
["LEDANT Charles","2015-04-17","2015-07-13",0,"2015-07-13",0,"CP","Acceptée",{"$f":"IF(OR(G826=\"Convention\",H826=\"Refusée\"),0,IF(H826=\"Annulée\",-(NETWORKDAYS.INTL(C826,E826,1,JFERIES)-D826-F826),NETWORKDAYS.INTL(C826,E826,1,JFERIES)-D826-F826))","v":1},"2015/07","",-1.0399999999999991]
["LOCATELLI Bruno","2015-04-17","2015-05-15",0,"2015-05-15",0,"CP","Acceptée",{"$f":"IF(OR(G827=\"Convention\",H827=\"Refusée\"),0,IF(H827=\"Annulée\",-(NETWORKDAYS.INTL(C827,E827,1,JFERIES)-D827-F827),NETWORKDAYS.INTL(C827,E827,1,JFERIES)-D827-F827))","v":1},"2015/05","",3.9600000000000009]
["LOCATELLI Bruno","2015-04-17","2015-05-26",0,"2015-05-29",0,"CP","Acceptée",{"$f":"IF(OR(G828=\"Convention\",H828=\"Refusée\"),0,IF(H828=\"Annulée\",-(NETWORKDAYS.INTL(C828,E828,1,JFERIES)-D828-F828),NETWORKDAYS.INTL(C828,E828,1,JFERIES)-D828-F828))","v":4},"2015/05","",-3.9999999999999147E-2]
["TAQUET Alain","2015-04-20","2015-05-26",0,"2015-05-26",0,"CP","Acceptée",{"$f":"IF(OR(G829=\"Convention\",H829=\"Refusée\"),0,IF(H829=\"Annulée\",-(NETWORKDAYS.INTL(C829,E829,1,JFERIES)-D829-F829),NETWORKDAYS.INTL(C829,E829,1,JFERIES)-D829-F829))","v":1},"2015/05","",1.9600000000000009]
["TAQUET Alain","2015-04-20","2015-07-13",0,"2015-07-13",0,"RTT","Acceptée",{"$f":"IF(OR(G830=\"Convention\",H830=\"Refusée\"),0,IF(H830=\"Annulée\",-(NETWORKDAYS.INTL(C830,E830,1,JFERIES)-D830-F830),NETWORKDAYS.INTL(C830,E830,1,JFERIES)-D830-F830))","v":1},"2015/07","",2]
["HEMLER Christelle","2015-04-21","2015-04-27",0,"2015-04-28",0,"CP","Acceptée",{"$f":"IF(OR(G831=\"Convention\",H831=\"Refusée\"),0,IF(H831=\"Annulée\",-(NETWORKDAYS.INTL(C831,E831,1,JFERIES)-D831-F831),NETWORKDAYS.INTL(C831,E831,1,JFERIES)-D831-F831))","v":2},"2015/04","",6.4600000000000009]
["DREVON Alain","2015-04-23","2015-04-27",0,"2015-04-27",0,"RTT","Acceptée",{"$f":"IF(OR(G832=\"Convention\",H832=\"Refusée\"),0,IF(H832=\"Annulée\",-(NETWORKDAYS.INTL(C832,E832,1,JFERIES)-D832-F832),NETWORKDAYS.INTL(C832,E832,1,JFERIES)-D832-F832))","v":1},"2015/04","",1.5]
["DREVON Alain","2015-04-23","2015-04-30",0,"2015-04-30",0,"RTT","Acceptée",{"$f":"IF(OR(G833=\"Convention\",H833=\"Refusée\"),0,IF(H833=\"Annulée\",-(NETWORKDAYS.INTL(C833,E833,1,JFERIES)-D833-F833),NETWORKDAYS.INTL(C833,E833,1,JFERIES)-D833-F833))","v":1},"2015/04","",1.5]
["BERTHE Magali","2015-04-23","2015-07-27",0,"2015-07-31",0,"CP","Acceptée",{"$f":"IF(OR(G834=\"Convention\",H834=\"Refusée\"),0,IF(H834=\"Annulée\",-(NETWORKDAYS.INTL(C834,E834,1,JFERIES)-D834-F834),NETWORKDAYS.INTL(C834,E834,1,JFERIES)-D834-F834))","v":5},"2015/07","Congés eté 2015",-22.43]
["BERTHE Magali","2015-04-23","2015-08-01",0,"2015-08-16",0,"CP","Acceptée",{"$f":"IF(OR(G835=\"Convention\",H835=\"Refusée\"),0,IF(H835=\"Annulée\",-(NETWORKDAYS.INTL(C835,E835,1,JFERIES)-D835-F835),NETWORKDAYS.INTL(C835,E835,1,JFERIES)-D835-F835))","v":10},"2015/08","Congés eté 2015"]
["SANTUCCI Lionel","2015-04-24","2015-05-04",0,"2015-05-15",0,"CP","Acceptée",{"$f":"IF(OR(G836=\"Convention\",H836=\"Refusée\"),0,IF(H836=\"Annulée\",-(NETWORKDAYS.INTL(C836,E836,1,JFERIES)-D836-F836),NETWORKDAYS.INTL(C836,E836,1,JFERIES)-D836-F836))","v":8},"2015/05","",-3.9999999999999147E-2]
["SANTUCCI Lionel","2015-04-24","2015-05-18",0,"2015-05-19",0,"RTT","Acceptée",{"$f":"IF(OR(G837=\"Convention\",H837=\"Refusée\"),0,IF(H837=\"Annulée\",-(NETWORKDAYS.INTL(C837,E837,1,JFERIES)-D837-F837),NETWORKDAYS.INTL(C837,E837,1,JFERIES)-D837-F837))","v":2},"2015/05","",0]
["GIRAUDON Alain","2015-04-27","2015-05-15",0,"2015-05-15",0,"RTT","Acceptée",{"$f":"IF(OR(G838=\"Convention\",H838=\"Refusée\"),0,IF(H838=\"Annulée\",-(NETWORKDAYS.INTL(C838,E838,1,JFERIES)-D838-F838),NETWORKDAYS.INTL(C838,E838,1,JFERIES)-D838-F838))","v":1},"2015/05","",""]
["GIRAUDON Alain","2015-04-27","2015-07-13",0,"2015-07-13",0,"RTT","Acceptée",{"$f":"IF(OR(G839=\"Convention\",H839=\"Refusée\"),0,IF(H839=\"Annulée\",-(NETWORKDAYS.INTL(C839,E839,1,JFERIES)-D839-F839),NETWORKDAYS.INTL(C839,E839,1,JFERIES)-D839-F839))","v":1},"2015/07","",""]
["MINAKIAN Mathilde","2015-04-27","2015-07-10",0,"2015-07-13",0,"CP","Acceptée",{"$f":"IF(OR(G840=\"Convention\",H840=\"Refusée\"),0,IF(H840=\"Annulée\",-(NETWORKDAYS.INTL(C840,E840,1,JFERIES)-D840-F840),NETWORKDAYS.INTL(C840,E840,1,JFERIES)-D840-F840))","v":2},"2015/07"]
["DREVON Alain","2015-04-28","2015-04-24",0,"2015-04-24",0.5,"RTT","Acceptée",{"$f":"IF(OR(G841=\"Convention\",H841=\"Refusée\"),0,IF(H841=\"Annulée\",-(NETWORKDAYS.INTL(C841,E841,1,JFERIES)-D841-F841),NETWORKDAYS.INTL(C841,E841,1,JFERIES)-D841-F841))","v":0.5},"2015/04","Régul. Absence vendredi matin",0]
["COUTANT Jean Paul","2015-04-30","2015-05-15",0,"2015-05-15",0,"RTT","Acceptée",{"$f":"IF(OR(G842=\"Convention\",H842=\"Refusée\"),0,IF(H842=\"Annulée\",-(NETWORKDAYS.INTL(C842,E842,1,JFERIES)-D842-F842),NETWORKDAYS.INTL(C842,E842,1,JFERIES)-D842-F842))","v":1},"2015/05","",0]
["CHEVALIER Yohan","2015-05-04","2015-05-18",0,"2015-05-18",0,"CP","Acceptée",{"$f":"IF(OR(G843=\"Convention\",H843=\"Refusée\"),0,IF(H843=\"Annulée\",-(NETWORKDAYS.INTL(C843,E843,1,JFERIES)-D843-F843),NETWORKDAYS.INTL(C843,E843,1,JFERIES)-D843-F843))","v":1},"2015/05","",-8.44]
["DEREPPE Bruno","2015-05-04","2015-05-15",0,"2015-05-15",0,"RTT","Acceptée",{"$f":"IF(OR(G844=\"Convention\",H844=\"Refusée\"),0,IF(H844=\"Annulée\",-(NETWORKDAYS.INTL(C844,E844,1,JFERIES)-D844-F844),NETWORKDAYS.INTL(C844,E844,1,JFERIES)-D844-F844))","v":1},"2015/05","",1.5]
["BEARZATTO Giovanni","2015-05-04","2015-05-15",0,"2015-05-15",0,"RTT","Acceptée",{"$f":"IF(OR(G845=\"Convention\",H845=\"Refusée\"),0,IF(H845=\"Annulée\",-(NETWORKDAYS.INTL(C845,E845,1,JFERIES)-D845-F845),NETWORKDAYS.INTL(C845,E845,1,JFERIES)-D845-F845))","v":1},"2015/05","",1]
["HAUTEBRANC Alexis","2015-05-04","2015-08-17",0,"2015-08-23",0,"CP","Acceptée",{"$f":"IF(OR(G846=\"Convention\",H846=\"Refusée\"),0,IF(H846=\"Annulée\",-(NETWORKDAYS.INTL(C846,E846,1,JFERIES)-D846-F846),NETWORKDAYS.INTL(C846,E846,1,JFERIES)-D846-F846))","v":5},"2015/08","Congés eté 2015",-15.04]
["VAUTRAIN Franck","2015-05-05","2015-05-15",0,"2015-05-19",0,"CP","Acceptée",{"$f":"IF(OR(G847=\"Convention\",H847=\"Refusée\"),0,IF(H847=\"Annulée\",-(NETWORKDAYS.INTL(C847,E847,1,JFERIES)-D847-F847),NETWORKDAYS.INTL(C847,E847,1,JFERIES)-D847-F847))","v":3},"2015/05","",1.9600000000000009]
["VAUTRAIN Franck","2015-05-05","2015-05-26",0,"2015-05-27",0,"CP","Acceptée",{"$f":"IF(OR(G848=\"Convention\",H848=\"Refusée\"),0,IF(H848=\"Annulée\",-(NETWORKDAYS.INTL(C848,E848,1,JFERIES)-D848-F848),NETWORKDAYS.INTL(C848,E848,1,JFERIES)-D848-F848))","v":2},"2015/05","",2.9600000000000009]
["GUINOT Nathalie","2015-05-05","2015-05-15",0,"2015-05-15",0,"CP","Acceptée",{"$f":"IF(OR(G849=\"Convention\",H849=\"Refusée\"),0,IF(H849=\"Annulée\",-(NETWORKDAYS.INTL(C849,E849,1,JFERIES)-D849-F849),NETWORKDAYS.INTL(C849,E849,1,JFERIES)-D849-F849))","v":1},"2015/05","",6.9600000000000009]
["HEMLER Christelle","2015-05-05","2015-05-11",0,"2015-05-11",0,"CP","Acceptée",{"$f":"IF(OR(G850=\"Convention\",H850=\"Refusée\"),0,IF(H850=\"Annulée\",-(NETWORKDAYS.INTL(C850,E850,1,JFERIES)-D850-F850),NETWORKDAYS.INTL(C850,E850,1,JFERIES)-D850-F850))","v":1},"2015/05","",5.4600000000000009]
["PONS Olivier","2015-05-06","2015-05-15",0,"2015-05-15",0,"RTT","Acceptée",{"$f":"IF(OR(G851=\"Convention\",H851=\"Refusée\"),0,IF(H851=\"Annulée\",-(NETWORKDAYS.INTL(C851,E851,1,JFERIES)-D851-F851),NETWORKDAYS.INTL(C851,E851,1,JFERIES)-D851-F851))","v":1},"2015/05","",2]
["DREVON Alain","2015-05-09","2015-05-15",0,"2015-05-15",0,"CP","Acceptée",{"$f":"IF(OR(G852=\"Convention\",H852=\"Refusée\"),0,IF(H852=\"Annulée\",-(NETWORKDAYS.INTL(C852,E852,1,JFERIES)-D852-F852),NETWORKDAYS.INTL(C852,E852,1,JFERIES)-D852-F852))","v":1},"2015/05","",4.4600000000000009]
["DREVON Alain","2015-05-09","2015-05-19",0,"2015-05-19",0.5,"CP","Acceptée",{"$f":"IF(OR(G853=\"Convention\",H853=\"Refusée\"),0,IF(H853=\"Annulée\",-(NETWORKDAYS.INTL(C853,E853,1,JFERIES)-D853-F853),NETWORKDAYS.INTL(C853,E853,1,JFERIES)-D853-F853))","v":0.5},"2015/05","Examens médicaux",4.9600000000000009]
["DREVON Alain","2015-05-09","2015-05-26",0,"2015-05-29",0,"CP","Acceptée",{"$f":"IF(OR(G854=\"Convention\",H854=\"Refusée\"),0,IF(H854=\"Annulée\",-(NETWORKDAYS.INTL(C854,E854,1,JFERIES)-D854-F854),NETWORKDAYS.INTL(C854,E854,1,JFERIES)-D854-F854))","v":4},"2015/05","",1.4600000000000009]
["DEREPPE Bruno","2015-05-11","2015-05-26",0,"2015-05-29",0,"CP","Acceptée",{"$f":"IF(OR(G855=\"Convention\",H855=\"Refusée\"),0,IF(H855=\"Annulée\",-(NETWORKDAYS.INTL(C855,E855,1,JFERIES)-D855-F855),NETWORKDAYS.INTL(C855,E855,1,JFERIES)-D855-F855))","v":4},"2015/05","",-3.9999999999999147E-2]
["COUTANT Jean Paul","2015-05-11","2015-05-20",0,"2015-05-20",0,"CP","Acceptée",{"$f":"IF(OR(G856=\"Convention\",H856=\"Refusée\"),0,IF(H856=\"Annulée\",-(NETWORKDAYS.INTL(C856,E856,1,JFERIES)-D856-F856),NETWORKDAYS.INTL(C856,E856,1,JFERIES)-D856-F856))","v":1},"2015/05","",5.9600000000000009]
["DREZET Olivier","2015-05-11","2015-07-13",0,"2015-07-13",0,"CP","Acceptée",{"$f":"IF(OR(G857=\"Convention\",H857=\"Refusée\"),0,IF(H857=\"Annulée\",-(NETWORKDAYS.INTL(C857,E857,1,JFERIES)-D857-F857),NETWORKDAYS.INTL(C857,E857,1,JFERIES)-D857-F857))","v":1},"2015/07","",3.4600000000000009]
["TAQUET Alain","2015-05-12","2015-05-21",0.5,"2015-05-21",0,"CP","Acceptée",{"$f":"IF(OR(G858=\"Convention\",H858=\"Refusée\"),0,IF(H858=\"Annulée\",-(NETWORKDAYS.INTL(C858,E858,1,JFERIES)-D858-F858),NETWORKDAYS.INTL(C858,E858,1,JFERIES)-D858-F858))","v":0.5},"2015/05","",1.4600000000000009]
["GIRAUDON Alain","2015-05-13","2015-08-03",0,"2015-08-28",0,"CP","Acceptée",{"$f":"IF(OR(G859=\"Convention\",H859=\"Refusée\"),0,IF(H859=\"Annulée\",-(NETWORKDAYS.INTL(C859,E859,1,JFERIES)-D859-F859),NETWORKDAYS.INTL(C859,E859,1,JFERIES)-D859-F859))","v":20},"2015/08","Congés eté 2015",-20.04]
["HEMLER Christelle","2015-05-13","2015-05-18",0,"2015-05-20",0,"CP","Acceptée",{"$f":"IF(OR(G860=\"Convention\",H860=\"Refusée\"),0,IF(H860=\"Annulée\",-(NETWORKDAYS.INTL(C860,E860,1,JFERIES)-D860-F860),NETWORKDAYS.INTL(C860,E860,1,JFERIES)-D860-F860))","v":3},"2015/05","",2.4600000000000009]
["GUINOT Nathalie","2015-05-13","2015-08-10",0,"2015-08-28",0,"CP","Acceptée",{"$f":"IF(OR(G861=\"Convention\",H861=\"Refusée\"),0,IF(H861=\"Annulée\",-(NETWORKDAYS.INTL(C861,E861,1,JFERIES)-D861-F861),NETWORKDAYS.INTL(C861,E861,1,JFERIES)-D861-F861))","v":15},"2015/08","Congés eté 2015",-13.04]
["DREZET Olivier","2015-05-13","2015-05-15",0,"2015-05-15",0,"CP","Acceptée",{"$f":"IF(OR(G862=\"Convention\",H862=\"Refusée\"),0,IF(H862=\"Annulée\",-(NETWORKDAYS.INTL(C862,E862,1,JFERIES)-D862-F862),NETWORKDAYS.INTL(C862,E862,1,JFERIES)-D862-F862))","v":1},"2015/05","",3.4600000000000009]
["BEARZATTO Giovanni","2015-05-13","2015-05-29",0,"2015-05-29",0,"CP","Acceptée",{"$f":"IF(OR(G863=\"Convention\",H863=\"Refusée\"),0,IF(H863=\"Annulée\",-(NETWORKDAYS.INTL(C863,E863,1,JFERIES)-D863-F863),NETWORKDAYS.INTL(C863,E863,1,JFERIES)-D863-F863))","v":1},"2015/05","",0.46000000000000085]
["MARZOUK Sami","2015-05-13","2015-08-03",0,"2015-08-28",0,"CP","Acceptée",{"$f":"IF(OR(G864=\"Convention\",H864=\"Refusée\"),0,IF(H864=\"Annulée\",-(NETWORKDAYS.INTL(C864,E864,1,JFERIES)-D864-F864),NETWORKDAYS.INTL(C864,E864,1,JFERIES)-D864-F864))","v":20},"2015/08","Congés eté 2015",-20.04]
["HEMLER Christelle","2015-05-13","2015-05-26",0,"2015-05-27",0,"CP","Acceptée",{"$f":"IF(OR(G865=\"Convention\",H865=\"Refusée\"),0,IF(H865=\"Annulée\",-(NETWORKDAYS.INTL(C865,E865,1,JFERIES)-D865-F865),NETWORKDAYS.INTL(C865,E865,1,JFERIES)-D865-F865))","v":2},"2015/05","",0.46000000000000085]
["POMMERELL Patrick","2015-05-14","2015-06-30",0,"2015-06-30",0,"RTT","Acceptée",{"$f":"IF(OR(G866=\"Convention\",H866=\"Refusée\"),0,IF(H866=\"Annulée\",-(NETWORKDAYS.INTL(C866,E866,1,JFERIES)-D866-F866),NETWORKDAYS.INTL(C866,E866,1,JFERIES)-D866-F866))","v":1},"2015/06","Examen Elsa",1.5]
["GUINOT Nathalie","2015-05-18","2015-05-21",0,"2015-05-22",0,"CP","Acceptée",{"$f":"IF(OR(G867=\"Convention\",H867=\"Refusée\"),0,IF(H867=\"Annulée\",-(NETWORKDAYS.INTL(C867,E867,1,JFERIES)-D867-F867),NETWORKDAYS.INTL(C867,E867,1,JFERIES)-D867-F867))","v":2},"2015/05","",-3.9999999999999147E-2]
["DREVON Alain","2015-05-18","2015-08-17",0,"2015-08-31",0,"CP","Acceptée",{"$f":"IF(OR(G868=\"Convention\",H868=\"Refusée\"),0,IF(H868=\"Annulée\",-(NETWORKDAYS.INTL(C868,E868,1,JFERIES)-D868-F868),NETWORKDAYS.INTL(C868,E868,1,JFERIES)-D868-F868))","v":11},"2015/08","Congés eté 2015",-15.04]
["DREVON Alain","2015-05-18","2015-09-01",0,"2015-09-04",0,"CP","Acceptée",{"$f":"IF(OR(G869=\"Convention\",H869=\"Refusée\"),0,IF(H869=\"Annulée\",-(NETWORKDAYS.INTL(C869,E869,1,JFERIES)-D869-F869),NETWORKDAYS.INTL(C869,E869,1,JFERIES)-D869-F869))","v":4},"2015/09","Congés eté 2016"]
["DREVON Alain","2015-05-18","2015-07-13",0,"2015-07-13",0,"CP","Acceptée",{"$f":"IF(OR(G870=\"Convention\",H870=\"Refusée\"),0,IF(H870=\"Annulée\",-(NETWORKDAYS.INTL(C870,E870,1,JFERIES)-D870-F870),NETWORKDAYS.INTL(C870,E870,1,JFERIES)-D870-F870))","v":1},"2015/07",null,-1.0399999999999991]
["COUTANT Jean Paul","2015-05-19","2015-07-27",0,"2015-07-31",0,"CP","Acceptée",{"$f":"IF(OR(G871=\"Convention\",H871=\"Refusée\"),0,IF(H871=\"Annulée\",-(NETWORKDAYS.INTL(C871,E871,1,JFERIES)-D871-F871),NETWORKDAYS.INTL(C871,E871,1,JFERIES)-D871-F871))","v":5},"2015/07","",0.96000000000000085]
["COUTANT Jean Paul","2015-05-19","2015-08-17",0,"2015-08-28",0,"CP","Acceptée",{"$f":"IF(OR(G872=\"Convention\",H872=\"Refusée\"),0,IF(H872=\"Annulée\",-(NETWORKDAYS.INTL(C872,E872,1,JFERIES)-D872-F872),NETWORKDAYS.INTL(C872,E872,1,JFERIES)-D872-F872))","v":10},"2015/08","",-4.0399999999999991]
["DEREPPE Bruno","2015-05-19","2015-08-03",0,"2015-08-28",0,"CP","Acceptée",{"$f":"IF(OR(G873=\"Convention\",H873=\"Refusée\"),0,IF(H873=\"Annulée\",-(NETWORKDAYS.INTL(C873,E873,1,JFERIES)-D873-F873),NETWORKDAYS.INTL(C873,E873,1,JFERIES)-D873-F873))","v":20},"2015/08","Congés été 2015",-20.04]
["GUIOT Fabien","2015-05-19","2015-05-26",0,"2015-05-26",0,"CP","Acceptée",{"$f":"IF(OR(G874=\"Convention\",H874=\"Refusée\"),0,IF(H874=\"Annulée\",-(NETWORKDAYS.INTL(C874,E874,1,JFERIES)-D874-F874),NETWORKDAYS.INTL(C874,E874,1,JFERIES)-D874-F874))","v":1},"2015/05","",-3.9999999999999147E-2]
["GUIOT Fabien","2015-05-19","2015-07-27",0,"2015-07-31",0,"CP","Acceptée",{"$f":"IF(OR(G875=\"Convention\",H875=\"Refusée\"),0,IF(H875=\"Annulée\",-(NETWORKDAYS.INTL(C875,E875,1,JFERIES)-D875-F875),NETWORKDAYS.INTL(C875,E875,1,JFERIES)-D875-F875))","v":5},"2015/07","Congés été 2015",-14.04]
["GUIOT Fabien","2015-05-19","2015-08-01",0,"2015-08-14",0,"CP","Acceptée",{"$f":"IF(OR(G876=\"Convention\",H876=\"Refusée\"),0,IF(H876=\"Annulée\",-(NETWORKDAYS.INTL(C876,E876,1,JFERIES)-D876-F876),NETWORKDAYS.INTL(C876,E876,1,JFERIES)-D876-F876))","v":10},"2015/08","Congés été 2015"]
["DREZET Olivier","2015-05-20","2015-05-20",0.5,"2015-05-20",0,"RTT","Acceptée",{"$f":"IF(OR(G877=\"Convention\",H877=\"Refusée\"),0,IF(H877=\"Annulée\",-(NETWORKDAYS.INTL(C877,E877,1,JFERIES)-D877-F877),NETWORKDAYS.INTL(C877,E877,1,JFERIES)-D877-F877))","v":0.5},"2015/05","",0]
["LANGE Sébastien","2015-05-20","2015-05-19",0,"2015-05-19",0.5,"CP","Acceptée",{"$f":"IF(OR(G878=\"Convention\",H878=\"Refusée\"),0,IF(H878=\"Annulée\",-(NETWORKDAYS.INTL(C878,E878,1,JFERIES)-D878-F878),NETWORKDAYS.INTL(C878,E878,1,JFERIES)-D878-F878))","v":0.5},"2015/05","rendez vous eprso notaire",-1.5]
["LANGE Sébastien","2015-05-20","2015-07-27",0,"2015-07-31",0,"CP","Acceptée",{"$f":"IF(OR(G879=\"Convention\",H879=\"Refusée\"),0,IF(H879=\"Annulée\",-(NETWORKDAYS.INTL(C879,E879,1,JFERIES)-D879-F879),NETWORKDAYS.INTL(C879,E879,1,JFERIES)-D879-F879))","v":5},"2015/07","CP",-6]
["LANGE Sébastien","2015-05-20","2015-08-10",0,"2015-08-21",0,"CP","Acceptée",{"$f":"IF(OR(G880=\"Convention\",H880=\"Refusée\"),0,IF(H880=\"Annulée\",-(NETWORKDAYS.INTL(C880,E880,1,JFERIES)-D880-F880),NETWORKDAYS.INTL(C880,E880,1,JFERIES)-D880-F880))","v":10},"2015/08","CP",-11]
["TAQUET Alain","2015-05-20","2015-06-04",0.5,"2015-06-04",0,"CP","Acceptée",{"$f":"IF(OR(G881=\"Convention\",H881=\"Refusée\"),0,IF(H881=\"Annulée\",-(NETWORKDAYS.INTL(C881,E881,1,JFERIES)-D881-F881),NETWORKDAYS.INTL(C881,E881,1,JFERIES)-D881-F881))","v":0.5},"2015/06","",0.96000000000000085]
["GUERIN Viviane","2015-05-21","2015-08-10",0,"2015-08-14",0,"CP","Acceptée",{"$f":"IF(OR(G882=\"Convention\",H882=\"Refusée\"),0,IF(H882=\"Annulée\",-(NETWORKDAYS.INTL(C882,E882,1,JFERIES)-D882-F882),NETWORKDAYS.INTL(C882,E882,1,JFERIES)-D882-F882))","v":5},"2015/08","",0.96000000000000085]
["CHEVALIER Yohan","2015-05-22","2015-08-17",0,"2015-08-21",0,"CP","Acceptée",{"$f":"IF(OR(G883=\"Convention\",H883=\"Refusée\"),0,IF(H883=\"Annulée\",-(NETWORKDAYS.INTL(C883,E883,1,JFERIES)-D883-F883),NETWORKDAYS.INTL(C883,E883,1,JFERIES)-D883-F883))","v":5},"2015/08","",-13.44]
["SOUCHET Alain","2015-05-22","2015-08-12",0,"2015-09-01",0,"CP","Acceptée",{"$f":"IF(OR(G884=\"Convention\",H884=\"Refusée\"),0,IF(H884=\"Annulée\",-(NETWORKDAYS.INTL(C884,E884,1,JFERIES)-D884-F884),NETWORKDAYS.INTL(C884,E884,1,JFERIES)-D884-F884))","v":15},"2015/09","Congés été 2015"]
["COUTANT Jean Paul","2015-05-28","2015-06-03",0,"2015-06-03",0,"CP","Acceptée",{"$f":"IF(OR(G885=\"Convention\",H885=\"Refusée\"),0,IF(H885=\"Annulée\",-(NETWORKDAYS.INTL(C885,E885,1,JFERIES)-D885-F885),NETWORKDAYS.INTL(C885,E885,1,JFERIES)-D885-F885))","v":1},"2015/06"]
["GUERIN Viviane","2015-05-29","2015-06-05",0,"2015-06-05",0,"RTT","Acceptée",{"$f":"IF(OR(G886=\"Convention\",H886=\"Refusée\"),0,IF(H886=\"Annulée\",-(NETWORKDAYS.INTL(C886,E886,1,JFERIES)-D886-F886),NETWORKDAYS.INTL(C886,E886,1,JFERIES)-D886-F886))","v":1},"2015/06","",0]
["LOCATELLI Bruno","2015-06-01","2015-06-24",0,"2015-06-24",0,"RTT","Acceptée",{"$f":"IF(OR(G887=\"Convention\",H887=\"Refusée\"),0,IF(H887=\"Annulée\",-(NETWORKDAYS.INTL(C887,E887,1,JFERIES)-D887-F887),NETWORKDAYS.INTL(C887,E887,1,JFERIES)-D887-F887))","v":1},"2015/06","",1]
["TAQUET Alain","2015-06-01","2015-06-25",0.5,"2015-06-25",0,"CP","Acceptée",{"$f":"IF(OR(G888=\"Convention\",H888=\"Refusée\"),0,IF(H888=\"Annulée\",-(NETWORKDAYS.INTL(C888,E888,1,JFERIES)-D888-F888),NETWORKDAYS.INTL(C888,E888,1,JFERIES)-D888-F888))","v":0.5},"2015/06","",0.96000000000000085]
["SANTUCCI Lionel","2015-06-02","2015-06-04",0,"2015-06-04",0,"CP","Acceptée",{"$f":"IF(OR(G889=\"Convention\",H889=\"Refusée\"),0,IF(H889=\"Annulée\",-(NETWORKDAYS.INTL(C889,E889,1,JFERIES)-D889-F889),NETWORKDAYS.INTL(C889,E889,1,JFERIES)-D889-F889))","v":1},"2015/06","",-1.0399999999999991]
["HEMLER Christelle","2015-06-03","2015-07-27",0,"2015-07-31",0,"CP","Acceptée",{"$f":"IF(OR(G890=\"Convention\",H890=\"Refusée\"),0,IF(H890=\"Annulée\",-(NETWORKDAYS.INTL(C890,E890,1,JFERIES)-D890-F890),NETWORKDAYS.INTL(C890,E890,1,JFERIES)-D890-F890))","v":5},"2015/07","Congés été 2015",-9.5399999999999991]
["HEMLER Christelle","2015-06-03","2015-08-01",0,"2015-08-07",0,"CP","Acceptée",{"$f":"IF(OR(G891=\"Convention\",H891=\"Refusée\"),0,IF(H891=\"Annulée\",-(NETWORKDAYS.INTL(C891,E891,1,JFERIES)-D891-F891),NETWORKDAYS.INTL(C891,E891,1,JFERIES)-D891-F891))","v":5},"2015/08","Congés été 2015"]
["HEMLER Christelle","2015-06-03","2015-08-31",0,"2015-08-31",0,"CP","Acceptée",{"$f":"IF(OR(G892=\"Convention\",H892=\"Refusée\"),0,IF(H892=\"Annulée\",-(NETWORKDAYS.INTL(C892,E892,1,JFERIES)-D892-F892),NETWORKDAYS.INTL(C892,E892,1,JFERIES)-D892-F892))","v":1},"2015/08","Congés été 2015",-4.5399999999999991]
["HEMLER Christelle","2015-06-03","2015-09-01",0,"2015-09-04",0,"CP","Acceptée",{"$f":"IF(OR(G893=\"Convention\",H893=\"Refusée\"),0,IF(H893=\"Annulée\",-(NETWORKDAYS.INTL(C893,E893,1,JFERIES)-D893-F893),NETWORKDAYS.INTL(C893,E893,1,JFERIES)-D893-F893))","v":4},"2015/09","Congés été 2015"]
["BERTHE Magali","2015-05-07","2015-05-15",0,"2015-05-15",0,"CP","Acceptée",{"$f":"IF(OR(G894=\"Convention\",H894=\"Refusée\"),0,IF(H894=\"Annulée\",-(NETWORKDAYS.INTL(C894,E894,1,JFERIES)-D894-F894),NETWORKDAYS.INTL(C894,E894,1,JFERIES)-D894-F894))","v":1},"2015/05"]
["COUTANT Jean Paul","2015-06-05","2015-06-17",0,"2015-06-17",0,"CP","Acceptée",{"$f":"IF(OR(G895=\"Convention\",H895=\"Refusée\"),0,IF(H895=\"Annulée\",-(NETWORKDAYS.INTL(C895,E895,1,JFERIES)-D895-F895),NETWORKDAYS.INTL(C895,E895,1,JFERIES)-D895-F895))","v":1},"2015/06","",17.96]
["POMMERELL Patrick","2015-06-08","2015-07-13",0,"2015-07-13",0,"RTT","Acceptée",{"$f":"IF(OR(G896=\"Convention\",H896=\"Refusée\"),0,IF(H896=\"Annulée\",-(NETWORKDAYS.INTL(C896,E896,1,JFERIES)-D896-F896),NETWORKDAYS.INTL(C896,E896,1,JFERIES)-D896-F896))","v":1},"2015/07","",2]
["BEARZATTO Giovanni","2015-06-08","2015-06-22",0,"2015-06-22",0,"CP","Acceptée",{"$f":"IF(OR(G897=\"Convention\",H897=\"Refusée\"),0,IF(H897=\"Annulée\",-(NETWORKDAYS.INTL(C897,E897,1,JFERIES)-D897-F897),NETWORKDAYS.INTL(C897,E897,1,JFERIES)-D897-F897))","v":1},"2015/06","Recup CP du 01/06/2015 annulé",28.46]
["PONS Olivier","2015-06-08","2015-08-07",0,"2015-08-24",0,"CP","Acceptée",{"$f":"IF(OR(G898=\"Convention\",H898=\"Refusée\"),0,IF(H898=\"Annulée\",-(NETWORKDAYS.INTL(C898,E898,1,JFERIES)-D898-F898),NETWORKDAYS.INTL(C898,E898,1,JFERIES)-D898-F898))","v":12},"2015/08"]
["POMMERELL Patrick","2015-06-08","2015-06-17",0.5,"2015-06-17",0,"RTT","Acceptée",{"$f":"IF(OR(G899=\"Convention\",H899=\"Refusée\"),0,IF(H899=\"Annulée\",-(NETWORKDAYS.INTL(C899,E899,1,JFERIES)-D899-F899),NETWORKDAYS.INTL(C899,E899,1,JFERIES)-D899-F899))","v":0.5},"2015/06","Bac Swann",2.5]
["POMMERELL Patrick","2015-06-08","2015-06-23",0,"2015-06-24",0.5,"CP","Acceptée",{"$f":"IF(OR(G900=\"Convention\",H900=\"Refusée\"),0,IF(H900=\"Annulée\",-(NETWORKDAYS.INTL(C900,E900,1,JFERIES)-D900-F900),NETWORKDAYS.INTL(C900,E900,1,JFERIES)-D900-F900))","v":1.5},"2015/06","bac Swann",1.5]
["POMMERELL Patrick","2015-06-08","2015-07-15",0,"2015-07-17",0,"CP","Acceptée",{"$f":"IF(OR(G901=\"Convention\",H901=\"Refusée\"),0,IF(H901=\"Annulée\",-(NETWORKDAYS.INTL(C901,E901,1,JFERIES)-D901-F901),NETWORKDAYS.INTL(C901,E901,1,JFERIES)-D901-F901))","v":3},"2015/07","",18.46]
["BEARZATTO Giovanni","2015-06-09","2015-07-13",0,"2015-07-13",0,"RTT","Acceptée",{"$f":"IF(OR(G902=\"Convention\",H902=\"Refusée\"),0,IF(H902=\"Annulée\",-(NETWORKDAYS.INTL(C902,E902,1,JFERIES)-D902-F902),NETWORKDAYS.INTL(C902,E902,1,JFERIES)-D902-F902))","v":1},"2015/07","",1]
["SOUCHET Alain","2015-06-09","2015-07-13",0,"2015-07-13",0,"CP","Acceptée",{"$f":"IF(OR(G903=\"Convention\",H903=\"Refusée\"),0,IF(H903=\"Annulée\",-(NETWORKDAYS.INTL(C903,E903,1,JFERIES)-D903-F903),NETWORKDAYS.INTL(C903,E903,1,JFERIES)-D903-F903))","v":1},"2015/07"]
["DREZET Olivier","2015-06-10","2015-06-29",0,"2015-06-29",0,"CP","Acceptée",{"$f":"IF(OR(G904=\"Convention\",H904=\"Refusée\"),0,IF(H904=\"Annulée\",-(NETWORKDAYS.INTL(C904,E904,1,JFERIES)-D904-F904),NETWORKDAYS.INTL(C904,E904,1,JFERIES)-D904-F904))","v":1},"2015/06","",-0.5]
["TAQUET Alain","2015-06-17","2015-06-24",0.5,"2015-06-24",0,"CP","Acceptée",{"$f":"IF(OR(G905=\"Convention\",H905=\"Refusée\"),0,IF(H905=\"Annulée\",-(NETWORKDAYS.INTL(C905,E905,1,JFERIES)-D905-F905),NETWORKDAYS.INTL(C905,E905,1,JFERIES)-D905-F905))","v":0.5},"2015/06","Solde CP N-1",25.96]
["TAQUET Alain","2015-06-22","2015-08-10",0,"2015-08-28",0,"CP","Acceptée",{"$f":"IF(OR(G906=\"Convention\",H906=\"Refusée\"),0,IF(H906=\"Annulée\",-(NETWORKDAYS.INTL(C906,E906,1,JFERIES)-D906-F906),NETWORKDAYS.INTL(C906,E906,1,JFERIES)-D906-F906))","v":15},"2015/08","Congés été 2015",10.96]
["HAUTEBRANC Alexis","2015-06-23","2015-07-17",0,"2015-07-17",0,"RTT","Acceptée",{"$f":"IF(OR(G907=\"Convention\",H907=\"Refusée\"),0,IF(H907=\"Annulée\",-(NETWORKDAYS.INTL(C907,E907,1,JFERIES)-D907-F907),NETWORKDAYS.INTL(C907,E907,1,JFERIES)-D907-F907))","v":1},"2015/07","",2]
["HAUTEBRANC Alexis","2015-06-23","2015-07-20",0,"2015-07-20",0,"RTT","Acceptée",{"$f":"IF(OR(G908=\"Convention\",H908=\"Refusée\"),0,IF(H908=\"Annulée\",-(NETWORKDAYS.INTL(C908,E908,1,JFERIES)-D908-F908),NETWORKDAYS.INTL(C908,E908,1,JFERIES)-D908-F908))","v":1},"2015/07","",2]
["HAUTEBRANC Alexis","2015-06-23","2015-08-03",0,"2015-08-03",0,"RTT","Acceptée",{"$f":"IF(OR(G909=\"Convention\",H909=\"Refusée\"),0,IF(H909=\"Annulée\",-(NETWORKDAYS.INTL(C909,E909,1,JFERIES)-D909-F909),NETWORKDAYS.INTL(C909,E909,1,JFERIES)-D909-F909))","v":1},"2015/08","",2]
["HAUTEBRANC Alexis","2015-06-23","2015-07-31",0,"2015-07-31",0,"CP","Acceptée",{"$f":"IF(OR(G910=\"Convention\",H910=\"Refusée\"),0,IF(H910=\"Annulée\",-(NETWORKDAYS.INTL(C910,E910,1,JFERIES)-D910-F910),NETWORKDAYS.INTL(C910,E910,1,JFERIES)-D910-F910))","v":1},"2015/07","",9.9600000000000009]
["COUTANT Jean Paul","2015-06-24","2015-07-01",0.5,"2015-07-01",0,"CP","Acceptée",{"$f":"IF(OR(G911=\"Convention\",H911=\"Refusée\"),0,IF(H911=\"Annulée\",-(NETWORKDAYS.INTL(C911,E911,1,JFERIES)-D911-F911),NETWORKDAYS.INTL(C911,E911,1,JFERIES)-D911-F911))","v":0.5},"2015/07","",17.46]
["LOCATELLI Bruno","2015-06-25","2015-07-13",0,"2015-07-13",0,"RTT","Acceptée",{"$f":"IF(OR(G912=\"Convention\",H912=\"Refusée\"),0,IF(H912=\"Annulée\",-(NETWORKDAYS.INTL(C912,E912,1,JFERIES)-D912-F912),NETWORKDAYS.INTL(C912,E912,1,JFERIES)-D912-F912))","v":1},"2015/07","",0]
["POMMERELL Patrick","2015-07-01","2015-07-07",0.5,"2015-07-07",0,"CP","Acceptée",{"$f":"IF(OR(G913=\"Convention\",H913=\"Refusée\"),0,IF(H913=\"Annulée\",-(NETWORKDAYS.INTL(C913,E913,1,JFERIES)-D913-F913),NETWORKDAYS.INTL(C913,E913,1,JFERIES)-D913-F913))","v":0.5},"2015/07","",16.46]
["MINAKIAN Mathilde","2015-07-01","2015-06-30",0,"2015-06-30",0.5,"CP","Acceptée",{"$f":"IF(OR(G914=\"Convention\",H914=\"Refusée\"),0,IF(H914=\"Annulée\",-(NETWORKDAYS.INTL(C914,E914,1,JFERIES)-D914-F914),NETWORKDAYS.INTL(C914,E914,1,JFERIES)-D914-F914))","v":0.5},"2015/06"]
["MINAKIAN Mathilde","2015-07-01","2015-08-03",0,"2015-08-31",0,"CP","Acceptée",{"$f":"IF(OR(G915=\"Convention\",H915=\"Refusée\"),0,IF(H915=\"Annulée\",-(NETWORKDAYS.INTL(C915,E915,1,JFERIES)-D915-F915),NETWORKDAYS.INTL(C915,E915,1,JFERIES)-D915-F915))","v":21},"2015/08","Congés été 2015"]
["TAQUET Alain","2015-07-01","2015-07-02",0,"2015-07-02",0.5,"RTT","Acceptée",{"$f":"IF(OR(G916=\"Convention\",H916=\"Refusée\"),0,IF(H916=\"Annulée\",-(NETWORKDAYS.INTL(C916,E916,1,JFERIES)-D916-F916),NETWORKDAYS.INTL(C916,E916,1,JFERIES)-D916-F916))","v":0.5},"2015/07"]
["TAQUET Alain","2015-07-01","2015-07-09",0,"2015-07-09",0.5,"RTT","Acceptée",{"$f":"IF(OR(G917=\"Convention\",H917=\"Refusée\"),0,IF(H917=\"Annulée\",-(NETWORKDAYS.INTL(C917,E917,1,JFERIES)-D917-F917),NETWORKDAYS.INTL(C917,E917,1,JFERIES)-D917-F917))","v":0.5},"2015/07"]
["GUINOT Nathalie","2015-07-03","2015-07-10",0,"2015-07-10",0,"RTT","Acceptée",{"$f":"IF(OR(G918=\"Convention\",H918=\"Refusée\"),0,IF(H918=\"Annulée\",-(NETWORKDAYS.INTL(C918,E918,1,JFERIES)-D918-F918),NETWORKDAYS.INTL(C918,E918,1,JFERIES)-D918-F918))","v":1},"2015/07","",3.5]
["GUINOT Nathalie","2015-07-03","2015-07-16",0,"2015-07-17",0,"RTT","Acceptée",{"$f":"IF(OR(G919=\"Convention\",H919=\"Refusée\"),0,IF(H919=\"Annulée\",-(NETWORKDAYS.INTL(C919,E919,1,JFERIES)-D919-F919),NETWORKDAYS.INTL(C919,E919,1,JFERIES)-D919-F919))","v":2},"2015/07","",2.5]
["GUINOT Nathalie","2015-07-03","2015-07-24",0,"2015-07-24",0,"RTT","Acceptée",{"$f":"IF(OR(G920=\"Convention\",H920=\"Refusée\"),0,IF(H920=\"Annulée\",-(NETWORKDAYS.INTL(C920,E920,1,JFERIES)-D920-F920),NETWORKDAYS.INTL(C920,E920,1,JFERIES)-D920-F920))","v":1},"2015/07","",3.5]
["KADEM Christophe","2015-07-03","2015-07-13",0,"2015-07-13",0,"CP","Acceptée",{"$f":"IF(OR(G921=\"Convention\",H921=\"Refusée\"),0,IF(H921=\"Annulée\",-(NETWORKDAYS.INTL(C921,E921,1,JFERIES)-D921-F921),NETWORKDAYS.INTL(C921,E921,1,JFERIES)-D921-F921))","v":1},"2015/07","",10.96]
["DEREPPE Bruno","2015-07-06","2015-07-13",0,"2015-07-13",0,"RTT","Acceptée",{"$f":"IF(OR(G922=\"Convention\",H922=\"Refusée\"),0,IF(H922=\"Annulée\",-(NETWORKDAYS.INTL(C922,E922,1,JFERIES)-D922-F922),NETWORKDAYS.INTL(C922,E922,1,JFERIES)-D922-F922))","v":1},"2015/07","",0.5]
["HEMLER Christelle","2015-07-06","2015-07-13",0,"2015-07-13",0,"RTT","Acceptée",{"$f":"IF(OR(G923=\"Convention\",H923=\"Refusée\"),0,IF(H923=\"Annulée\",-(NETWORKDAYS.INTL(C923,E923,1,JFERIES)-D923-F923),NETWORKDAYS.INTL(C923,E923,1,JFERIES)-D923-F923))","v":1},"2015/07","",1.5]
["HEMLER Christelle","2015-07-06","2015-07-20",0,"2015-07-20",0,"RTT","Acceptée",{"$f":"IF(OR(G924=\"Convention\",H924=\"Refusée\"),0,IF(H924=\"Annulée\",-(NETWORKDAYS.INTL(C924,E924,1,JFERIES)-D924-F924),NETWORKDAYS.INTL(C924,E924,1,JFERIES)-D924-F924))","v":1},"2015/07","",1.5]
["HEMLER Christelle","2015-07-06","2015-07-21",0,"2015-07-21",0.5,"RTT","Acceptée",{"$f":"IF(OR(G925=\"Convention\",H925=\"Refusée\"),0,IF(H925=\"Annulée\",-(NETWORKDAYS.INTL(C925,E925,1,JFERIES)-D925-F925),NETWORKDAYS.INTL(C925,E925,1,JFERIES)-D925-F925))","v":0.5},"2015/07","",""]
["PONS Olivier","2015-07-07","2015-07-13",0,"2015-07-13",0,"RTT","Acceptée",{"$f":"IF(OR(G926=\"Convention\",H926=\"Refusée\"),0,IF(H926=\"Annulée\",-(NETWORKDAYS.INTL(C926,E926,1,JFERIES)-D926-F926),NETWORKDAYS.INTL(C926,E926,1,JFERIES)-D926-F926))","v":1},"2015/07","",1]
["PONS Olivier","2015-07-07","2015-08-06",0,"2015-08-06",0,"CP","Acceptée",{"$f":"IF(OR(G927=\"Convention\",H927=\"Refusée\"),0,IF(H927=\"Annulée\",-(NETWORKDAYS.INTL(C927,E927,1,JFERIES)-D927-F927),NETWORKDAYS.INTL(C927,E927,1,JFERIES)-D927-F927))","v":1},"2015/08","Congés été 2015",12.96]
["PONS Olivier","2015-07-07","2015-08-24",0,"2015-08-25",0,"CP","Acceptée",{"$f":"IF(OR(G928=\"Convention\",H928=\"Refusée\"),0,IF(H928=\"Annulée\",-(NETWORKDAYS.INTL(C928,E928,1,JFERIES)-D928-F928),NETWORKDAYS.INTL(C928,E928,1,JFERIES)-D928-F928))","v":2},"2015/08","Congés été 2015",11.96]
["LOYER Michel","2015-07-07","2015-08-03",0,"2015-08-21",0,"CP","Acceptée",{"$f":"IF(OR(G929=\"Convention\",H929=\"Refusée\"),0,IF(H929=\"Annulée\",-(NETWORKDAYS.INTL(C929,E929,1,JFERIES)-D929-F929),NETWORKDAYS.INTL(C929,E929,1,JFERIES)-D929-F929))","v":15},"2015/08","",10.96]
["GUIOT Fabien","2015-07-07","2015-07-15",0,"2015-07-15",0,"RTT","Acceptée",{"$f":"IF(OR(G930=\"Convention\",H930=\"Refusée\"),0,IF(H930=\"Annulée\",-(NETWORKDAYS.INTL(C930,E930,1,JFERIES)-D930-F930),NETWORKDAYS.INTL(C930,E930,1,JFERIES)-D930-F930))","v":1},"2015/07","",1]
["GUIOT Fabien","2015-07-07","2015-08-17",0,"2015-08-17",0,"RTT","Acceptée",{"$f":"IF(OR(G931=\"Convention\",H931=\"Refusée\"),0,IF(H931=\"Annulée\",-(NETWORKDAYS.INTL(C931,E931,1,JFERIES)-D931-F931),NETWORKDAYS.INTL(C931,E931,1,JFERIES)-D931-F931))","v":1},"2015/08","",1]
["BEARZATTO Giovanni","2015-07-09","2015-08-17",0,"2015-08-31",0,"CP","Acceptée",{"$f":"IF(OR(G932=\"Convention\",H932=\"Refusée\"),0,IF(H932=\"Annulée\",-(NETWORKDAYS.INTL(C932,E932,1,JFERIES)-D932-F932),NETWORKDAYS.INTL(C932,E932,1,JFERIES)-D932-F932))","v":11},"2015/08","Congés été 2015",17.46]
["BEARZATTO Giovanni","2015-07-09","2015-09-01",0,"2015-09-04",0,"CP","Acceptée",{"$f":"IF(OR(G933=\"Convention\",H933=\"Refusée\"),0,IF(H933=\"Annulée\",-(NETWORKDAYS.INTL(C933,E933,1,JFERIES)-D933-F933),NETWORKDAYS.INTL(C933,E933,1,JFERIES)-D933-F933))","v":4},"2015/09","Congés été 2015",24.46]
["MARZOUK Sami","2015-07-10","2015-07-13",0,"2015-07-13",0,"RTT","Acceptée",{"$f":"IF(OR(G934=\"Convention\",H934=\"Refusée\"),0,IF(H934=\"Annulée\",-(NETWORKDAYS.INTL(C934,E934,1,JFERIES)-D934-F934),NETWORKDAYS.INTL(C934,E934,1,JFERIES)-D934-F934))","v":1},"2015/07","",1]
["LEDANT Charles","2015-07-15","2015-07-10",0,"2015-07-10",0,"RTT","Acceptée",{"$f":"IF(OR(G935=\"Convention\",H935=\"Refusée\"),0,IF(H935=\"Annulée\",-(NETWORKDAYS.INTL(C935,E935,1,JFERIES)-D935-F935),NETWORKDAYS.INTL(C935,E935,1,JFERIES)-D935-F935))","v":1},"2015/07","",1]
["COUTANT Jean Paul","2015-07-15","2015-07-13",0,"2015-07-13",0,"CP","Acceptée",{"$f":"IF(OR(G936=\"Convention\",H936=\"Refusée\"),0,IF(H936=\"Annulée\",-(NETWORKDAYS.INTL(C936,E936,1,JFERIES)-D936-F936),NETWORKDAYS.INTL(C936,E936,1,JFERIES)-D936-F936))","v":1},"2015/07"]
["LOCATELLI Bruno","2015-07-16","2015-10-22",0,"2015-10-22",0,"CP","Acceptée",{"$f":"IF(OR(G937=\"Convention\",H937=\"Refusée\"),0,IF(H937=\"Annulée\",-(NETWORKDAYS.INTL(C937,E937,1,JFERIES)-D937-F937),NETWORKDAYS.INTL(C937,E937,1,JFERIES)-D937-F937))","v":1},"2015/10","",10.96]
["TAQUET Alain","2015-07-17","2015-07-23",0.5,"2015-07-23",0,"RTT","Acceptée",{"$f":"IF(OR(G938=\"Convention\",H938=\"Refusée\"),0,IF(H938=\"Annulée\",-(NETWORKDAYS.INTL(C938,E938,1,JFERIES)-D938-F938),NETWORKDAYS.INTL(C938,E938,1,JFERIES)-D938-F938))","v":0.5},"2015/07","",0.5]
["LOYER Michel","2015-07-21","2015-08-24",0,"2015-08-24",0,"RTT","Acceptée",{"$f":"IF(OR(G939=\"Convention\",H939=\"Refusée\"),0,IF(H939=\"Annulée\",-(NETWORKDAYS.INTL(C939,E939,1,JFERIES)-D939-F939),NETWORKDAYS.INTL(C939,E939,1,JFERIES)-D939-F939))","v":1},"2015/08","",0]
["VAUTRAIN Franck","2015-07-24","2015-07-13",0.5,"2015-07-13",0,"RTT","Acceptée",{"$f":"IF(OR(G940=\"Convention\",H940=\"Refusée\"),0,IF(H940=\"Annulée\",-(NETWORKDAYS.INTL(C940,E940,1,JFERIES)-D940-F940),NETWORKDAYS.INTL(C940,E940,1,JFERIES)-D940-F940))","v":0.5},"2015/07","",{"$error":"#VALUE!"}]
["DREZET Olivier","2015-07-27","2015-08-17",0,"2015-09-03",0,"CP","Acceptée",{"$f":"IF(OR(G941=\"Convention\",H941=\"Refusée\"),0,IF(H941=\"Annulée\",-(NETWORKDAYS.INTL(C941,E941,1,JFERIES)-D941-F941),NETWORKDAYS.INTL(C941,E941,1,JFERIES)-D941-F941))","v":14},"2015/08","",13.46]
["DREZET Olivier","2015-07-27","2015-08-07",0,"2015-08-07",0,"CP","Acceptée",{"$f":"IF(OR(G942=\"Convention\",H942=\"Refusée\"),0,IF(H942=\"Annulée\",-(NETWORKDAYS.INTL(C942,E942,1,JFERIES)-D942-F942),NETWORKDAYS.INTL(C942,E942,1,JFERIES)-D942-F942))","v":1},"2015/08","",26.46]
["TAQUET Alain","2015-07-30","2015-08-06",0.5,"2015-08-06",0,"RTT","Acceptée",{"$f":"IF(OR(G943=\"Convention\",H943=\"Refusée\"),0,IF(H943=\"Annulée\",-(NETWORKDAYS.INTL(C943,E943,1,JFERIES)-D943-F943),NETWORKDAYS.INTL(C943,E943,1,JFERIES)-D943-F943))","v":0.5},"2015/08","",0]
["CHEVALIER Yohan","2015-08-03","2015-12-21",0,"2015-12-24",0,"Convention","Acceptée",{"$f":"IF(OR(G944=\"Convention\",H944=\"Refusée\"),0,IF(H944=\"Annulée\",-(NETWORKDAYS.INTL(C944,E944,1,JFERIES)-D944-F944),NETWORKDAYS.INTL(C944,E944,1,JFERIES)-D944-F944))","v":0},"2015/12","Mariage",""]
["CHEVALIER Yohan","2015-08-03","2015-12-25",0,"2016-01-01",0,"CP","Acceptée",{"$f":"IF(OR(G945=\"Convention\",H945=\"Refusée\"),0,IF(H945=\"Annulée\",-(NETWORKDAYS.INTL(C945,E945,1,JFERIES)-D945-F945),NETWORKDAYS.INTL(C945,E945,1,JFERIES)-D945-F945))","v":4},"2015/12","exc eptionnel -- mariage",-4.7399999999999984]
["GUERIN Viviane","2015-08-07","2015-10-02",0.5,"2015-10-02",0,"RTD Recup","En attente",{"$f":"IF(OR(G946=\"Convention\",H946=\"Refusée\"),0,IF(H946=\"Annulée\",-(NETWORKDAYS.INTL(C946,E946,1,JFERIES)-D946-F946),NETWORKDAYS.INTL(C946,E946,1,JFERIES)-D946-F946))","v":0.5},"2015/10","annulé",""]
["SANTUCCI Lionel","2015-08-17","2015-08-14",0,"2015-08-14",0,"CP","Acceptée",{"$f":"IF(OR(G947=\"Convention\",H947=\"Refusée\"),0,IF(H947=\"Annulée\",-(NETWORKDAYS.INTL(C947,E947,1,JFERIES)-D947-F947),NETWORKDAYS.INTL(C947,E947,1,JFERIES)-D947-F947))","v":1},"2015/08","",12.96]
["POMMERELL Patrick","2015-08-30","2015-09-01",0,"2015-09-01",0.5,"CP","Acceptée",{"$f":"IF(OR(G948=\"Convention\",H948=\"Refusée\"),0,IF(H948=\"Annulée\",-(NETWORKDAYS.INTL(C948,E948,1,JFERIES)-D948-F948),NETWORKDAYS.INTL(C948,E948,1,JFERIES)-D948-F948))","v":0.5},"2015/09","",15.96]
["KADEM Christophe","2015-09-10","2015-10-19",0,"2015-10-20",0,"CP","Acceptée",{"$f":"IF(OR(G949=\"Convention\",H949=\"Refusée\"),0,IF(H949=\"Annulée\",-(NETWORKDAYS.INTL(C949,E949,1,JFERIES)-D949-F949),NETWORKDAYS.INTL(C949,E949,1,JFERIES)-D949-F949))","v":2},"2015/10","",8.9600000000000009]
["BEARZATTO Giovanni","2015-09-14","2015-10-12",0,"2015-10-12",0,"CP","Acceptée",{"$f":"IF(OR(G950=\"Convention\",H950=\"Refusée\"),0,IF(H950=\"Annulée\",-(NETWORKDAYS.INTL(C950,E950,1,JFERIES)-D950-F950),NETWORKDAYS.INTL(C950,E950,1,JFERIES)-D950-F950))","v":1},"2015/10","",12.46]
["GUINOT Nathalie","2015-09-14","2015-09-15",0,"2015-09-15",0.5,"RTT","Acceptée",{"$f":"IF(OR(G951=\"Convention\",H951=\"Refusée\"),0,IF(H951=\"Annulée\",-(NETWORKDAYS.INTL(C951,E951,1,JFERIES)-D951-F951),NETWORKDAYS.INTL(C951,E951,1,JFERIES)-D951-F951))","v":0.5},"2015/09","",0]
["LOCATELLI Bruno","2015-09-16","2016-03-14",0,"2016-03-18",0,"CP","Acceptée",{"$f":"IF(OR(G952=\"Convention\",H952=\"Refusée\"),0,IF(H952=\"Annulée\",-(NETWORKDAYS.INTL(C952,E952,1,JFERIES)-D952-F952),NETWORKDAYS.INTL(C952,E952,1,JFERIES)-D952-F952))","v":5},"2016/03","",5.9600000000000009]
["LOCATELLI Bruno","2015-09-16","2016-03-11",0,"2016-03-11",0,"Convention","Acceptée",{"$f":"IF(OR(G953=\"Convention\",H953=\"Refusée\"),0,IF(H953=\"Annulée\",-(NETWORKDAYS.INTL(C953,E953,1,JFERIES)-D953-F953),NETWORKDAYS.INTL(C953,E953,1,JFERIES)-D953-F953))","v":0},"2016/03","Mariage de ma fille",""]
["DREVON Alain","2015-09-16","2015-09-22",0.5,"2015-09-22",0,"CP","Acceptée",{"$f":"IF(OR(G954=\"Convention\",H954=\"Refusée\"),0,IF(H954=\"Annulée\",-(NETWORKDAYS.INTL(C954,E954,1,JFERIES)-D954-F954),NETWORKDAYS.INTL(C954,E954,1,JFERIES)-D954-F954))","v":0.5},"2015/09","",11.46]
["DREZET Olivier","2015-09-17","2015-12-23",0,"2015-12-24",0,"CP","Acceptée",{"$f":"IF(OR(G955=\"Convention\",H955=\"Refusée\"),0,IF(H955=\"Annulée\",-(NETWORKDAYS.INTL(C955,E955,1,JFERIES)-D955-F955),NETWORKDAYS.INTL(C955,E955,1,JFERIES)-D955-F955))","v":2},"2015/12","",10.46]
["LOYER Michel","2015-09-17","2015-10-26",0,"2015-10-26",0,"CP","Acceptée",{"$f":"IF(OR(G956=\"Convention\",H956=\"Refusée\"),0,IF(H956=\"Annulée\",-(NETWORKDAYS.INTL(C956,E956,1,JFERIES)-D956-F956),NETWORKDAYS.INTL(C956,E956,1,JFERIES)-D956-F956))","v":1},"2015/10","",9.9600000000000009]
["COUTANT Jean Paul","2015-09-22","2015-09-21",0,"2015-09-21",0,"CP","Acceptée",{"$f":"IF(OR(G957=\"Convention\",H957=\"Refusée\"),0,IF(H957=\"Annulée\",-(NETWORKDAYS.INTL(C957,E957,1,JFERIES)-D957-F957),NETWORKDAYS.INTL(C957,E957,1,JFERIES)-D957-F957))","v":1},"2015/09","",15.46]
["HAUTEBRANC Alexis","2015-09-22","2015-10-15",0.5,"2015-10-16",0,"CP","Acceptée",{"$f":"IF(OR(G958=\"Convention\",H958=\"Refusée\"),0,IF(H958=\"Annulée\",-(NETWORKDAYS.INTL(C958,E958,1,JFERIES)-D958-F958),NETWORKDAYS.INTL(C958,E958,1,JFERIES)-D958-F958))","v":1.5},"2015/10","",8.4600000000000009]
["SANTUCCI Lionel","2015-09-30","2015-10-09",0,"2015-10-09",0,"CP","Acceptée",{"$f":"IF(OR(G959=\"Convention\",H959=\"Refusée\"),0,IF(H959=\"Annulée\",-(NETWORKDAYS.INTL(C959,E959,1,JFERIES)-D959-F959),NETWORKDAYS.INTL(C959,E959,1,JFERIES)-D959-F959))","v":1},"2015/10","",11.96]
["SANTUCCI Lionel","2015-09-30","2015-10-06",0,"2015-10-06",0,"CP","Acceptée",{"$f":"IF(OR(G960=\"Convention\",H960=\"Refusée\"),0,IF(H960=\"Annulée\",-(NETWORKDAYS.INTL(C960,E960,1,JFERIES)-D960-F960),NETWORKDAYS.INTL(C960,E960,1,JFERIES)-D960-F960))","v":1},"2015/10","",11.96]
["KOSCIELNY Philippe","2015-10-06","2015-08-20",0,"2015-08-21",0,"CP","Acceptée",{"$f":"IF(OR(G961=\"Convention\",H961=\"Refusée\"),0,IF(H961=\"Annulée\",-(NETWORKDAYS.INTL(C961,E961,1,JFERIES)-D961-F961),NETWORKDAYS.INTL(C961,E961,1,JFERIES)-D961-F961))","v":2},"2015/08","",-2]
["CHEVALIER Yohan","2015-10-07","2015-10-16",0,"2015-10-16",0,"CP","Acceptée",{"$f":"IF(OR(G962=\"Convention\",H962=\"Refusée\"),0,IF(H962=\"Annulée\",-(NETWORKDAYS.INTL(C962,E962,1,JFERIES)-D962-F962),NETWORKDAYS.INTL(C962,E962,1,JFERIES)-D962-F962))","v":1},"2015/10","",-5.7399999999999984]
["MARZOUK Sami","2015-10-07","2015-10-06",0,"2015-10-06",0,"CP","Acceptée",{"$f":"IF(OR(G963=\"Convention\",H963=\"Refusée\"),0,IF(H963=\"Annulée\",-(NETWORKDAYS.INTL(C963,E963,1,JFERIES)-D963-F963),NETWORKDAYS.INTL(C963,E963,1,JFERIES)-D963-F963))","v":1},"2015/10","",7.9600000000000009]
["GUERIN Viviane","2015-10-09","2015-11-20",0,"2015-11-20",0,"RTD Recup","Acceptée",{"$f":"IF(OR(G964=\"Convention\",H964=\"Refusée\"),0,IF(H964=\"Annulée\",-(NETWORKDAYS.INTL(C964,E964,1,JFERIES)-D964-F964),NETWORKDAYS.INTL(C964,E964,1,JFERIES)-D964-F964))","v":1},"2015/11","",""]
["GUERIN Viviane","2015-10-09","2015-11-23",0,"2015-11-23",0,"RTD Recup","Acceptée",{"$f":"IF(OR(G965=\"Convention\",H965=\"Refusée\"),0,IF(H965=\"Annulée\",-(NETWORKDAYS.INTL(C965,E965,1,JFERIES)-D965-F965),NETWORKDAYS.INTL(C965,E965,1,JFERIES)-D965-F965))","v":1},"2015/11","",""]
["SANTUCCI Lionel","2015-10-12","2015-10-13",0,"2015-10-13",0,"CP","Acceptée",{"$f":"IF(OR(G966=\"Convention\",H966=\"Refusée\"),0,IF(H966=\"Annulée\",-(NETWORKDAYS.INTL(C966,E966,1,JFERIES)-D966-F966),NETWORKDAYS.INTL(C966,E966,1,JFERIES)-D966-F966))","v":1},"2015/10","",9.9600000000000009]
["COUTANT Jean Paul","2015-10-12","2015-11-04",0.5,"2015-11-04",0,"CP","Acceptée",{"$f":"IF(OR(G967=\"Convention\",H967=\"Refusée\"),0,IF(H967=\"Annulée\",-(NETWORKDAYS.INTL(C967,E967,1,JFERIES)-D967-F967),NETWORKDAYS.INTL(C967,E967,1,JFERIES)-D967-F967))","v":0.5},"2015/11","",14.96]
["LOCATELLI Bruno","2015-10-19","2015-10-22",0,"2015-10-22",0,"CP","Annulée",{"$f":"IF(OR(G968=\"Convention\",H968=\"Refusée\"),0,IF(H968=\"Annulée\",-(NETWORKDAYS.INTL(C968,E968,1,JFERIES)-D968-F968),NETWORKDAYS.INTL(C968,E968,1,JFERIES)-D968-F968))","v":-1},"2015/10","",6.9600000000000009]
["DREVON Alain","2015-10-20","2015-10-29",0,"2015-10-30",0,"CP","Acceptée",{"$f":"IF(OR(G969=\"Convention\",H969=\"Refusée\"),0,IF(H969=\"Annulée\",-(NETWORKDAYS.INTL(C969,E969,1,JFERIES)-D969-F969),NETWORKDAYS.INTL(C969,E969,1,JFERIES)-D969-F969))","v":2},"2015/10","",9.4600000000000009]
["DREVON Alain","2015-10-21","2015-10-29",0.5,"2015-10-30",0,"CP","Annulée",{"$f":"IF(OR(G970=\"Convention\",H970=\"Refusée\"),0,IF(H970=\"Annulée\",-(NETWORKDAYS.INTL(C970,E970,1,JFERIES)-D970-F970),NETWORKDAYS.INTL(C970,E970,1,JFERIES)-D970-F970))","v":-1.5},"2015/10","",12.96]
["DREZET Olivier","2015-10-22","2016-04-04",0,"2016-04-08",0,"CP","Acceptée",{"$f":"IF(OR(G971=\"Convention\",H971=\"Refusée\"),0,IF(H971=\"Annulée\",-(NETWORKDAYS.INTL(C971,E971,1,JFERIES)-D971-F971),NETWORKDAYS.INTL(C971,E971,1,JFERIES)-D971-F971))","v":5},"2016/04","",5.4600000000000009]
["LEDANT Charles","2015-10-22","2015-11-04",0,"2015-11-04",0,"RTT","Acceptée",{"$f":"IF(OR(G972=\"Convention\",H972=\"Refusée\"),0,IF(H972=\"Annulée\",-(NETWORKDAYS.INTL(C972,E972,1,JFERIES)-D972-F972),NETWORKDAYS.INTL(C972,E972,1,JFERIES)-D972-F972))","v":1},"2015/11","",0]
["GUERIN Viviane","2015-10-23","2015-12-23",0,"2015-12-24",0,"CP","Acceptée",{"$f":"IF(OR(G973=\"Convention\",H973=\"Refusée\"),0,IF(H973=\"Annulée\",-(NETWORKDAYS.INTL(C973,E973,1,JFERIES)-D973-F973),NETWORKDAYS.INTL(C973,E973,1,JFERIES)-D973-F973))","v":2},"2015/12","",9.9600000000000009]
["HAUTEBRANC Alexis","2015-10-26","2015-11-12",0,"2015-11-12",0,"CP","Acceptée",{"$f":"IF(OR(G974=\"Convention\",H974=\"Refusée\"),0,IF(H974=\"Annulée\",-(NETWORKDAYS.INTL(C974,E974,1,JFERIES)-D974-F974),NETWORKDAYS.INTL(C974,E974,1,JFERIES)-D974-F974))","v":1},"2015/11","",7.4600000000000009]
["POMMERELL Patrick","2015-11-04","2015-11-04",0.5,"2015-11-04",0,"CP","Acceptée",{"$f":"IF(OR(G975=\"Convention\",H975=\"Refusée\"),0,IF(H975=\"Annulée\",-(NETWORKDAYS.INTL(C975,E975,1,JFERIES)-D975-F975),NETWORKDAYS.INTL(C975,E975,1,JFERIES)-D975-F975))","v":0.5},"2015/11","",15.46]
["POMMERELL Patrick","2015-11-04","2015-11-06",0.5,"2015-11-06",0,"CP","Acceptée",{"$f":"IF(OR(G976=\"Convention\",H976=\"Refusée\"),0,IF(H976=\"Annulée\",-(NETWORKDAYS.INTL(C976,E976,1,JFERIES)-D976-F976),NETWORKDAYS.INTL(C976,E976,1,JFERIES)-D976-F976))","v":0.5},"2015/11","",15.46]
["POMMERELL Patrick","2015-11-04","2015-12-28",0,"2015-12-29",0,"CP","Acceptée",{"$f":"IF(OR(G977=\"Convention\",H977=\"Refusée\"),0,IF(H977=\"Annulée\",-(NETWORKDAYS.INTL(C977,E977,1,JFERIES)-D977-F977),NETWORKDAYS.INTL(C977,E977,1,JFERIES)-D977-F977))","v":2},"2015/12","",13.96]
["GUIOT Fabien","2015-11-05","2015-11-06",0.5,"2015-11-06",0,"CP","Acceptée",{"$f":"IF(OR(G978=\"Convention\",H978=\"Refusée\"),0,IF(H978=\"Annulée\",-(NETWORKDAYS.INTL(C978,E978,1,JFERIES)-D978-F978),NETWORKDAYS.INTL(C978,E978,1,JFERIES)-D978-F978))","v":0.5},"2015/11","",10.46]
["TAQUET Alain","2015-11-05","2015-12-28",0,"2015-12-28",0,"CP","Acceptée",{"$f":"IF(OR(G979=\"Convention\",H979=\"Refusée\"),0,IF(H979=\"Annulée\",-(NETWORKDAYS.INTL(C979,E979,1,JFERIES)-D979-F979),NETWORKDAYS.INTL(C979,E979,1,JFERIES)-D979-F979))","v":1},"2015/12","",9.9600000000000009]
["SOUCHET Alain","2015-11-06","2015-12-24",0,"2015-12-24",0,"CP","Acceptée",{"$f":"IF(OR(G980=\"Convention\",H980=\"Refusée\"),0,IF(H980=\"Annulée\",-(NETWORKDAYS.INTL(C980,E980,1,JFERIES)-D980-F980),NETWORKDAYS.INTL(C980,E980,1,JFERIES)-D980-F980))","v":1},"2015/12","",12.96]
["DREVON Alain","2015-11-06","2015-11-09",0,"2015-11-10",0,"CP","Acceptée",{"$f":"IF(OR(G981=\"Convention\",H981=\"Refusée\"),0,IF(H981=\"Annulée\",-(NETWORKDAYS.INTL(C981,E981,1,JFERIES)-D981-F981),NETWORKDAYS.INTL(C981,E981,1,JFERIES)-D981-F981))","v":2},"2015/11","",8.9600000000000009]
["DREVON Alain","2015-11-08","2015-11-09",0.5,"2015-11-09",0,"CP","Annulée",{"$f":"IF(OR(G982=\"Convention\",H982=\"Refusée\"),0,IF(H982=\"Annulée\",-(NETWORKDAYS.INTL(C982,E982,1,JFERIES)-D982-F982),NETWORKDAYS.INTL(C982,E982,1,JFERIES)-D982-F982))","v":-0.5},"2015/11"]
["DEREPPE Bruno","2015-11-09","2015-11-13",0,"2015-11-13",0,"CP","Acceptée",{"$f":"IF(OR(G983=\"Convention\",H983=\"Refusée\"),0,IF(H983=\"Annulée\",-(NETWORKDAYS.INTL(C983,E983,1,JFERIES)-D983-F983),NETWORKDAYS.INTL(C983,E983,1,JFERIES)-D983-F983))","v":1},{"$f":"YEAR(Tabsaisies[[#This Row],[Fin]])&\"/\"&TEXT(Tabsaisies[[#This Row],[Fin]],\"mm\")","v":"2015/11"},"",6.9600000000000009]
["GUINOT Nathalie","2015-11-12","2016-02-22",0,"2016-02-26",0,"CP","Acceptée",{"$f":"IF(OR(G984=\"Convention\",H984=\"Refusée\"),0,IF(H984=\"Annulée\",-(NETWORKDAYS.INTL(C984,E984,1,JFERIES)-D984-F984),NETWORKDAYS.INTL(C984,E984,1,JFERIES)-D984-F984))","v":5},{"$f":"YEAR(Tabsaisies[[#This Row],[Fin]])&\"/\"&TEXT(Tabsaisies[[#This Row],[Fin]],\"mm\")","v":"2016/02"},"",4.9600000000000009]
["DREVON Alain","2015-11-12","2015-11-27",0.5,"2015-11-27",0,"CP","Acceptée",{"$f":"IF(OR(G985=\"Convention\",H985=\"Refusée\"),0,IF(H985=\"Annulée\",-(NETWORKDAYS.INTL(C985,E985,1,JFERIES)-D985-F985),NETWORKDAYS.INTL(C985,E985,1,JFERIES)-D985-F985))","v":0.5},{"$f":"YEAR(Tabsaisies[[#This Row],[Fin]])&\"/\"&TEXT(Tabsaisies[[#This Row],[Fin]],\"mm\")","v":"2015/11"},"",8.9600000000000009]
["LEDANT Charles","2015-11-12","2015-12-24",0,"2015-12-24",0,"CP","Acceptée",{"$f":"IF(OR(G986=\"Convention\",H986=\"Refusée\"),0,IF(H986=\"Annulée\",-(NETWORKDAYS.INTL(C986,E986,1,JFERIES)-D986-F986),NETWORKDAYS.INTL(C986,E986,1,JFERIES)-D986-F986))","v":1},{"$f":"YEAR(Tabsaisies[[#This Row],[Fin]])&\"/\"&TEXT(Tabsaisies[[#This Row],[Fin]],\"mm\")","v":"2015/12"},"",7.9600000000000009]
["LEDANT Charles","2015-11-12","2015-12-28",0,"2015-12-28",0,"CP","Acceptée",{"$f":"IF(OR(G987=\"Convention\",H987=\"Refusée\"),0,IF(H987=\"Annulée\",-(NETWORKDAYS.INTL(C987,E987,1,JFERIES)-D987-F987),NETWORKDAYS.INTL(C987,E987,1,JFERIES)-D987-F987))","v":1},{"$f":"YEAR(Tabsaisies[[#This Row],[Fin]])&\"/\"&TEXT(Tabsaisies[[#This Row],[Fin]],\"mm\")","v":"2015/12"},"",7.9600000000000009]
["LEDANT Charles","2015-11-12","2015-12-31",0,"2015-12-31",0,"CP","Acceptée",{"$f":"IF(OR(G988=\"Convention\",H988=\"Refusée\"),0,IF(H988=\"Annulée\",-(NETWORKDAYS.INTL(C988,E988,1,JFERIES)-D988-F988),NETWORKDAYS.INTL(C988,E988,1,JFERIES)-D988-F988))","v":1},{"$f":"YEAR(Tabsaisies[[#This Row],[Fin]])&\"/\"&TEXT(Tabsaisies[[#This Row],[Fin]],\"mm\")","v":"2015/12"},"",7.9600000000000009]
["BERTHE Magali","2015-11-16","2015-11-20",0.5,"2015-11-20",0,"RTD Recup","Acceptée",{"$f":"IF(OR(G989=\"Convention\",H989=\"Refusée\"),0,IF(H989=\"Annulée\",-(NETWORKDAYS.INTL(C989,E989,1,JFERIES)-D989-F989),NETWORKDAYS.INTL(C989,E989,1,JFERIES)-D989-F989))","v":0.5},{"$f":"YEAR(Tabsaisies[[#This Row],[Fin]])&\"/\"&TEXT(Tabsaisies[[#This Row],[Fin]],\"mm\")","v":"2015/11"},"",""]
["HAUTEBRANC Alexis","2015-11-16","2015-12-24",0.5,"2015-12-24",0,"CP","Acceptée",{"$f":"IF(OR(G990=\"Convention\",H990=\"Refusée\"),0,IF(H990=\"Annulée\",-(NETWORKDAYS.INTL(C990,E990,1,JFERIES)-D990-F990),NETWORKDAYS.INTL(C990,E990,1,JFERIES)-D990-F990))","v":0.5},{"$f":"YEAR(Tabsaisies[[#This Row],[Fin]])&\"/\"&TEXT(Tabsaisies[[#This Row],[Fin]],\"mm\")","v":"2015/12"},"",6.9600000000000009]
["HAUTEBRANC Alexis","2015-11-16","2015-12-30",0,"2015-12-31",0,"CP","Acceptée",{"$f":"IF(OR(G991=\"Convention\",H991=\"Refusée\"),0,IF(H991=\"Annulée\",-(NETWORKDAYS.INTL(C991,E991,1,JFERIES)-D991-F991),NETWORKDAYS.INTL(C991,E991,1,JFERIES)-D991-F991))","v":2},{"$f":"YEAR(Tabsaisies[[#This Row],[Fin]])&\"/\"&TEXT(Tabsaisies[[#This Row],[Fin]],\"mm\")","v":"2015/12"},"",5.4600000000000009]
["POMMERELL Patrick","2015-11-16","2015-11-18",0.5,"2015-11-18",0,"CP","Acceptée",{"$f":"IF(OR(G992=\"Convention\",H992=\"Refusée\"),0,IF(H992=\"Annulée\",-(NETWORKDAYS.INTL(C992,E992,1,JFERIES)-D992-F992),NETWORKDAYS.INTL(C992,E992,1,JFERIES)-D992-F992))","v":0.5},{"$f":"YEAR(Tabsaisies[[#This Row],[Fin]])&\"/\"&TEXT(Tabsaisies[[#This Row],[Fin]],\"mm\")","v":"2015/11"},"",12.46]
["POMMERELL Patrick","2015-11-19","2015-12-11",0,"2015-12-11",0.5,"CP","Acceptée",{"$f":"IF(OR(G993=\"Convention\",H993=\"Refusée\"),0,IF(H993=\"Annulée\",-(NETWORKDAYS.INTL(C993,E993,1,JFERIES)-D993-F993),NETWORKDAYS.INTL(C993,E993,1,JFERIES)-D993-F993))","v":0.5},{"$f":"YEAR(Tabsaisies[[#This Row],[Fin]])&\"/\"&TEXT(Tabsaisies[[#This Row],[Fin]],\"mm\")","v":"2015/12"},"",11.96]
["GUERIN Viviane","2015-11-24","2015-12-02",0.5,"2015-12-02",0,"RTD Recup","Acceptée",{"$f":"IF(OR(G994=\"Convention\",H994=\"Refusée\"),0,IF(H994=\"Annulée\",-(NETWORKDAYS.INTL(C994,E994,1,JFERIES)-D994-F994),NETWORKDAYS.INTL(C994,E994,1,JFERIES)-D994-F994))","v":0.5},{"$f":"YEAR(Tabsaisies[[#This Row],[Fin]])&\"/\"&TEXT(Tabsaisies[[#This Row],[Fin]],\"mm\")","v":"2015/12"},"",""]
["COUTANT Jean Paul","2015-11-25","2015-12-30",0.5,"2015-12-30",0,"CP","Acceptée",{"$f":"IF(OR(G995=\"Convention\",H995=\"Refusée\"),0,IF(H995=\"Annulée\",-(NETWORKDAYS.INTL(C995,E995,1,JFERIES)-D995-F995),NETWORKDAYS.INTL(C995,E995,1,JFERIES)-D995-F995))","v":0.5},{"$f":"YEAR(Tabsaisies[[#This Row],[Fin]])&\"/\"&TEXT(Tabsaisies[[#This Row],[Fin]],\"mm\")","v":"2015/12"},"",14.46]
["BEARZATTO Giovanni","2015-11-26","2015-12-11",0,"2015-12-11",0,"CP","Acceptée",{"$f":"IF(OR(G996=\"Convention\",H996=\"Refusée\"),0,IF(H996=\"Annulée\",-(NETWORKDAYS.INTL(C996,E996,1,JFERIES)-D996-F996),NETWORKDAYS.INTL(C996,E996,1,JFERIES)-D996-F996))","v":1},{"$f":"YEAR(Tabsaisies[[#This Row],[Fin]])&\"/\"&TEXT(Tabsaisies[[#This Row],[Fin]],\"mm\")","v":"2015/12"},"",11.46]
["BEARZATTO Giovanni","2015-11-26","2015-12-31",0,"2016-01-04",0,"CP","Acceptée",{"$f":"IF(OR(G997=\"Convention\",H997=\"Refusée\"),0,IF(H997=\"Annulée\",-(NETWORKDAYS.INTL(C997,E997,1,JFERIES)-D997-F997),NETWORKDAYS.INTL(C997,E997,1,JFERIES)-D997-F997))","v":2},{"$f":"YEAR(Tabsaisies[[#This Row],[Fin]])&\"/\"&TEXT(Tabsaisies[[#This Row],[Fin]],\"mm\")","v":"2016/01"},"",10.46]
["KOSCIELNY Philippe","2015-11-27","2015-12-23",0,"2015-12-24",0,"CP","Acceptée",{"$f":"IF(OR(G998=\"Convention\",H998=\"Refusée\"),0,IF(H998=\"Annulée\",-(NETWORKDAYS.INTL(C998,E998,1,JFERIES)-D998-F998),NETWORKDAYS.INTL(C998,E998,1,JFERIES)-D998-F998))","v":2},{"$f":"YEAR(Tabsaisies[[#This Row],[Fin]])&\"/\"&TEXT(Tabsaisies[[#This Row],[Fin]],\"mm\")","v":"2015/12"},"",""]
["KOSCIELNY Philippe","2015-11-27","2016-01-07",0,"2016-01-07",0,"CP","Acceptée",{"$f":"IF(OR(G999=\"Convention\",H999=\"Refusée\"),0,IF(H999=\"Annulée\",-(NETWORKDAYS.INTL(C999,E999,1,JFERIES)-D999-F999),NETWORKDAYS.INTL(C999,E999,1,JFERIES)-D999-F999))","v":1},{"$f":"YEAR(Tabsaisies[[#This Row],[Fin]])&\"/\"&TEXT(Tabsaisies[[#This Row],[Fin]],\"mm\")","v":"2016/01"},""]
["LOCATELLI Bruno","2015-11-30","2015-03-11",0,"2015-03-11",0,"Convention","Acceptée",{"$f":"IF(OR(G1000=\"Convention\",H1000=\"Refusée\"),0,IF(H1000=\"Annulée\",-(NETWORKDAYS.INTL(C1000,E1000,1,JFERIES)-D1000-F1000),NETWORKDAYS.INTL(C1000,E1000,1,JFERIES)-D1000-F1000))","v":0},{"$f":"YEAR(Tabsaisies[[#This Row],[Fin]])&\"/\"&TEXT(Tabsaisies[[#This Row],[Fin]],\"mm\")","v":"2015/03"},"",""]
["LOCATELLI Bruno","2015-11-30","2015-12-23",0,"2015-12-24",0,"CP","Acceptée",{"$f":"IF(OR(G1001=\"Convention\",H1001=\"Refusée\"),0,IF(H1001=\"Annulée\",-(NETWORKDAYS.INTL(C1001,E1001,1,JFERIES)-D1001-F1001),NETWORKDAYS.INTL(C1001,E1001,1,JFERIES)-D1001-F1001))","v":2},{"$f":"YEAR(Tabsaisies[[#This Row],[Fin]])&\"/\"&TEXT(Tabsaisies[[#This Row],[Fin]],\"mm\")","v":"2015/12"}]
["LOCATELLI Bruno","2015-11-30","2015-12-31",0,"2015-12-31",0,"CP","Acceptée",{"$f":"IF(OR(G1002=\"Convention\",H1002=\"Refusée\"),0,IF(H1002=\"Annulée\",-(NETWORKDAYS.INTL(C1002,E1002,1,JFERIES)-D1002-F1002),NETWORKDAYS.INTL(C1002,E1002,1,JFERIES)-D1002-F1002))","v":1},{"$f":"YEAR(Tabsaisies[[#This Row],[Fin]])&\"/\"&TEXT(Tabsaisies[[#This Row],[Fin]],\"mm\")","v":"2015/12"}]
["MARZOUK Sami","2015-11-30","2015-12-02",0,"2015-12-02",0.5,"RTT","Acceptée",{"$f":"IF(OR(G1003=\"Convention\",H1003=\"Refusée\"),0,IF(H1003=\"Annulée\",-(NETWORKDAYS.INTL(C1003,E1003,1,JFERIES)-D1003-F1003),NETWORKDAYS.INTL(C1003,E1003,1,JFERIES)-D1003-F1003))","v":0.5},{"$f":"YEAR(Tabsaisies[[#This Row],[Fin]])&\"/\"&TEXT(Tabsaisies[[#This Row],[Fin]],\"mm\")","v":"2015/12"}]
["VAUTRAIN Franck","2015-12-01","2015-12-29",0,"2015-12-31",0,"CP","Acceptée",{"$f":"IF(OR(G1004=\"Convention\",H1004=\"Refusée\"),0,IF(H1004=\"Annulée\",-(NETWORKDAYS.INTL(C1004,E1004,1,JFERIES)-D1004-F1004),NETWORKDAYS.INTL(C1004,E1004,1,JFERIES)-D1004-F1004))","v":3},"2015/12","",4.9600000000000009]
["LOCATELLI Bruno","2015-12-02","2015-12-04",0.5,"2015-12-04",0,"CP","Acceptée",{"$f":"IF(OR(G1005=\"Convention\",H1005=\"Refusée\"),0,IF(H1005=\"Annulée\",-(NETWORKDAYS.INTL(C1005,E1005,1,JFERIES)-D1005-F1005),NETWORKDAYS.INTL(C1005,E1005,1,JFERIES)-D1005-F1005))","v":0.5},"2015/12","",3.4600000000000009]
["SANTUCCI Lionel","2015-12-03","2015-11-20",0,"2015-11-23",0,"CP","Acceptée",{"$f":"IF(OR(G1006=\"Convention\",H1006=\"Refusée\"),0,IF(H1006=\"Annulée\",-(NETWORKDAYS.INTL(C1006,E1006,1,JFERIES)-D1006-F1006),NETWORKDAYS.INTL(C1006,E1006,1,JFERIES)-D1006-F1006))","v":2},"2015/11","",7.9600000000000009]
["SANTUCCI Lionel","2015-12-03","2015-12-07",0,"2015-12-07",0,"CP","Acceptée",{"$f":"IF(OR(G1007=\"Convention\",H1007=\"Refusée\"),0,IF(H1007=\"Annulée\",-(NETWORKDAYS.INTL(C1007,E1007,1,JFERIES)-D1007-F1007),NETWORKDAYS.INTL(C1007,E1007,1,JFERIES)-D1007-F1007))","v":1},"2015/12","",8.9600000000000009]
["POMMERELL Patrick","2015-12-06","2015-12-11",0.5,"2015-12-11",0,"CP","Acceptée",{"$f":"IF(OR(G1008=\"Convention\",H1008=\"Refusée\"),0,IF(H1008=\"Annulée\",-(NETWORKDAYS.INTL(C1008,E1008,1,JFERIES)-D1008-F1008),NETWORKDAYS.INTL(C1008,E1008,1,JFERIES)-D1008-F1008))","v":0.5},"2015/12","",11.46]
["DREVON Alain","2015-12-07","2015-12-24",0,"2015-12-28",0,"CP","Acceptée",{"$f":"IF(OR(G1009=\"Convention\",H1009=\"Refusée\"),0,IF(H1009=\"Annulée\",-(NETWORKDAYS.INTL(C1009,E1009,1,JFERIES)-D1009-F1009),NETWORKDAYS.INTL(C1009,E1009,1,JFERIES)-D1009-F1009))","v":2},"2015/12","",6.9600000000000009]
["GIRAUDON Alain","2015-12-10","2015-12-24",0.5,"2015-12-24",0,"CP","Acceptée",{"$f":"IF(OR(G1010=\"Convention\",H1010=\"Refusée\"),0,IF(H1010=\"Annulée\",-(NETWORKDAYS.INTL(C1010,E1010,1,JFERIES)-D1010-F1010),NETWORKDAYS.INTL(C1010,E1010,1,JFERIES)-D1010-F1010))","v":0.5},"2015/12","",5.4600000000000009]
["KOSCIELNY Philippe","2015-12-10","2015-12-14",0,"2015-12-14",0,"CP","Acceptée",{"$f":"IF(OR(G1011=\"Convention\",H1011=\"Refusée\"),0,IF(H1011=\"Annulée\",-(NETWORKDAYS.INTL(C1011,E1011,1,JFERIES)-D1011-F1011),NETWORKDAYS.INTL(C1011,E1011,1,JFERIES)-D1011-F1011))","v":1},"2015/12","",-6]
["KOSCIELNY Philippe","2015-12-10","2015-12-21",0,"2015-12-21",0,"CP","Acceptée",{"$f":"IF(OR(G1012=\"Convention\",H1012=\"Refusée\"),0,IF(H1012=\"Annulée\",-(NETWORKDAYS.INTL(C1012,E1012,1,JFERIES)-D1012-F1012),NETWORKDAYS.INTL(C1012,E1012,1,JFERIES)-D1012-F1012))","v":1},"2015/12","",-6]
["COUTANT Jean Paul","2015-12-16","2015-12-16",0,"2015-12-16",0,"CP","Acceptée",{"$f":"IF(OR(G1013=\"Convention\",H1013=\"Refusée\"),0,IF(H1013=\"Annulée\",-(NETWORKDAYS.INTL(C1013,E1013,1,JFERIES)-D1013-F1013),NETWORKDAYS.INTL(C1013,E1013,1,JFERIES)-D1013-F1013))","v":1},"2015/12","",13.46]
["MARZOUK Sami","2015-12-18","2015-12-31",0,"2015-12-31",0,"CP","Acceptée",{"$f":"IF(OR(G1014=\"Convention\",H1014=\"Refusée\"),0,IF(H1014=\"Annulée\",-(NETWORKDAYS.INTL(C1014,E1014,1,JFERIES)-D1014-F1014),NETWORKDAYS.INTL(C1014,E1014,1,JFERIES)-D1014-F1014))","v":1},"2015/12","",6.9600000000000009]
["COUTANT Jean Paul","2015-12-21","2016-02-29",0,"2016-03-04",0,"CP","Acceptée",{"$f":"IF(OR(G1015=\"Convention\",H1015=\"Refusée\"),0,IF(H1015=\"Annulée\",-(NETWORKDAYS.INTL(C1015,E1015,1,JFERIES)-D1015-F1015),NETWORKDAYS.INTL(C1015,E1015,1,JFERIES)-D1015-F1015))","v":5},"2016/02","",8.4600000000000009]
["PONS Olivier","2015-12-21","2015-12-17",0.5,"2015-12-17",0,"CP","Acceptée",{"$f":"IF(OR(G1016=\"Convention\",H1016=\"Refusée\"),0,IF(H1016=\"Annulée\",-(NETWORKDAYS.INTL(C1016,E1016,1,JFERIES)-D1016-F1016),NETWORKDAYS.INTL(C1016,E1016,1,JFERIES)-D1016-F1016))","v":0.5},"2015/12","",10.46]
["PONS Olivier","2015-12-21","2015-12-24",0,"2015-12-24",0,"CP","Acceptée",{"$f":"IF(OR(G1017=\"Convention\",H1017=\"Refusée\"),0,IF(H1017=\"Annulée\",-(NETWORKDAYS.INTL(C1017,E1017,1,JFERIES)-D1017-F1017),NETWORKDAYS.INTL(C1017,E1017,1,JFERIES)-D1017-F1017))","v":1},"2015/12","",9.9600000000000009]
["PONS Olivier","2015-12-21","2015-12-31",0,"2015-12-31",0,"CP","Acceptée",{"$f":"IF(OR(G1018=\"Convention\",H1018=\"Refusée\"),0,IF(H1018=\"Annulée\",-(NETWORKDAYS.INTL(C1018,E1018,1,JFERIES)-D1018-F1018),NETWORKDAYS.INTL(C1018,E1018,1,JFERIES)-D1018-F1018))","v":1},"2015/12","",9.9600000000000009]
["LOCATELLI Bruno","2015-12-21","2016-01-14",0,"2016-01-14",0,"CP","Acceptée",{"$f":"IF(OR(G1019=\"Convention\",H1019=\"Refusée\"),0,IF(H1019=\"Annulée\",-(NETWORKDAYS.INTL(C1019,E1019,1,JFERIES)-D1019-F1019),NETWORKDAYS.INTL(C1019,E1019,1,JFERIES)-D1019-F1019))","v":1},"2016/01","",2.4600000000000009]
["LOCATELLI Bruno","2015-12-21","2016-01-29",0,"2016-01-29",0,"CP","Acceptée",{"$f":"IF(OR(G1020=\"Convention\",H1020=\"Refusée\"),0,IF(H1020=\"Annulée\",-(NETWORKDAYS.INTL(C1020,E1020,1,JFERIES)-D1020-F1020),NETWORKDAYS.INTL(C1020,E1020,1,JFERIES)-D1020-F1020))","v":1},"2016/01","",2.4600000000000009]
["LOCATELLI Bruno","2015-12-21","2016-02-01",0,"2016-02-01",0,"CP","Acceptée",{"$f":"IF(OR(G1021=\"Convention\",H1021=\"Refusée\"),0,IF(H1021=\"Annulée\",-(NETWORKDAYS.INTL(C1021,E1021,1,JFERIES)-D1021-F1021),NETWORKDAYS.INTL(C1021,E1021,1,JFERIES)-D1021-F1021))","v":1},"2016/02","",2.4600000000000009]
["SOUCHET Alain","2015-12-22","2015-12-31",0,"2015-12-31",0,"RTT","Acceptée",{"$f":"IF(OR(G1022=\"Convention\",H1022=\"Refusée\"),0,IF(H1022=\"Annulée\",-(NETWORKDAYS.INTL(C1022,E1022,1,JFERIES)-D1022-F1022),NETWORKDAYS.INTL(C1022,E1022,1,JFERIES)-D1022-F1022))","v":1},"2015/12","",3.5]
["LOYER Michel","2015-12-30","2016-02-11",0,"2016-02-12",0,"CP","Acceptée",{"$f":"IF(OR(G1023=\"Convention\",H1023=\"Refusée\"),0,IF(H1023=\"Annulée\",-(NETWORKDAYS.INTL(C1023,E1023,1,JFERIES)-D1023-F1023),NETWORKDAYS.INTL(C1023,E1023,1,JFERIES)-D1023-F1023))","v":2},"2016/02","",7.9600000000000009]
["LOYER Michel","2015-12-30","2016-04-08",0,"2016-04-15",0,"CP","Acceptée",{"$f":"IF(OR(G1024=\"Convention\",H1024=\"Refusée\"),0,IF(H1024=\"Annulée\",-(NETWORKDAYS.INTL(C1024,E1024,1,JFERIES)-D1024-F1024),NETWORKDAYS.INTL(C1024,E1024,1,JFERIES)-D1024-F1024))","v":6},"2016/04","",3.9600000000000009]
["KADEM Christophe","2016-01-02","2016-02-08",0,"2016-02-08",0,"CP","Acceptée",{"$f":"IF(OR(G1025=\"Convention\",H1025=\"Refusée\"),0,IF(H1025=\"Annulée\",-(NETWORKDAYS.INTL(C1025,E1025,1,JFERIES)-D1025-F1025),NETWORKDAYS.INTL(C1025,E1025,1,JFERIES)-D1025-F1025))","v":1},"2016/02","",7.9600000000000009]
["MARAIS Bernard","2016-01-05","2016-03-29",0,"2016-04-01",0,"CP","Acceptée",{"$f":"IF(OR(G1026=\"Convention\",H1026=\"Refusée\"),0,IF(H1026=\"Annulée\",-(NETWORKDAYS.INTL(C1026,E1026,1,JFERIES)-D1026-F1026),NETWORKDAYS.INTL(C1026,E1026,1,JFERIES)-D1026-F1026))","v":4},"2016/03","",4.9600000000000009]
["KADEM Christophe","2016-01-05","2016-04-04",0,"2016-04-04",0,"CP","Acceptée",{"$f":"IF(OR(G1027=\"Convention\",H1027=\"Refusée\"),0,IF(H1027=\"Annulée\",-(NETWORKDAYS.INTL(C1027,E1027,1,JFERIES)-D1027-F1027),NETWORKDAYS.INTL(C1027,E1027,1,JFERIES)-D1027-F1027))","v":1},"2016/04","",7.9600000000000009]
["KADEM Christophe","2016-01-05","2016-05-06",0,"2016-05-06",0,"CP","Acceptée",{"$f":"IF(OR(G1028=\"Convention\",H1028=\"Refusée\"),0,IF(H1028=\"Annulée\",-(NETWORKDAYS.INTL(C1028,E1028,1,JFERIES)-D1028-F1028),NETWORKDAYS.INTL(C1028,E1028,1,JFERIES)-D1028-F1028))","v":1},"2016/05","",7.9600000000000009]
["BEARZATTO Giovanni","2016-01-05","2016-01-29",0,"2016-01-29",0,"CP","Acceptée",{"$f":"IF(OR(G1029=\"Convention\",H1029=\"Refusée\"),0,IF(H1029=\"Annulée\",-(NETWORKDAYS.INTL(C1029,E1029,1,JFERIES)-D1029-F1029),NETWORKDAYS.INTL(C1029,E1029,1,JFERIES)-D1029-F1029))","v":1},"2016/01","",8.4600000000000009]
["HEMLER Christelle","2016-01-05","2016-02-15",0,"2016-02-19",0,"CP","Acceptée",{"$f":"IF(OR(G1030=\"Convention\",H1030=\"Refusée\"),0,IF(H1030=\"Annulée\",-(NETWORKDAYS.INTL(C1030,E1030,1,JFERIES)-D1030-F1030),NETWORKDAYS.INTL(C1030,E1030,1,JFERIES)-D1030-F1030))","v":5},"2016/02","",6.4600000000000009]
["MARAIS Bernard","2016-01-06","2016-05-02",0,"2016-05-04",0,"CP","Acceptée",{"$f":"IF(OR(G1031=\"Convention\",H1031=\"Refusée\"),0,IF(H1031=\"Annulée\",-(NETWORKDAYS.INTL(C1031,E1031,1,JFERIES)-D1031-F1031),NETWORKDAYS.INTL(C1031,E1031,1,JFERIES)-D1031-F1031))","v":3},"2016/05","",1.9600000000000009]
["MARAIS Bernard","2016-01-06","2016-05-06",0,"2016-05-06",0,"CP","Acceptée",{"$f":"IF(OR(G1032=\"Convention\",H1032=\"Refusée\"),0,IF(H1032=\"Annulée\",-(NETWORKDAYS.INTL(C1032,E1032,1,JFERIES)-D1032-F1032),NETWORKDAYS.INTL(C1032,E1032,1,JFERIES)-D1032-F1032))","v":1},"2016/05","",3.9600000000000009]
["MARAIS Bernard","2016-01-06","2016-05-17",0,"2016-05-17",0,"CP","Acceptée",{"$f":"IF(OR(G1033=\"Convention\",H1033=\"Refusée\"),0,IF(H1033=\"Annulée\",-(NETWORKDAYS.INTL(C1033,E1033,1,JFERIES)-D1033-F1033),NETWORKDAYS.INTL(C1033,E1033,1,JFERIES)-D1033-F1033))","v":1},"2016/05","",3.9600000000000009]
["SANTUCCI Lionel","2016-01-07","2016-01-11",0,"2016-01-11",0,"CP","Acceptée",{"$f":"IF(OR(G1034=\"Convention\",H1034=\"Refusée\"),0,IF(H1034=\"Annulée\",-(NETWORKDAYS.INTL(C1034,E1034,1,JFERIES)-D1034-F1034),NETWORKDAYS.INTL(C1034,E1034,1,JFERIES)-D1034-F1034))","v":1},"2016/01","",5.9600000000000009]
["HAUTEBRANC Alexis","2016-01-11","2016-01-22",0,"2016-01-22",0,"CP","Acceptée",{"$f":"IF(OR(G1035=\"Convention\",H1035=\"Refusée\"),0,IF(H1035=\"Annulée\",-(NETWORKDAYS.INTL(C1035,E1035,1,JFERIES)-D1035-F1035),NETWORKDAYS.INTL(C1035,E1035,1,JFERIES)-D1035-F1035))","v":1},"2016/01","",3.9600000000000009]
["DREVON Alain","2016-01-11","2016-01-21",0.5,"2016-01-21",0,"CP","Acceptée",{"$f":"IF(OR(G1036=\"Convention\",H1036=\"Refusée\"),0,IF(H1036=\"Annulée\",-(NETWORKDAYS.INTL(C1036,E1036,1,JFERIES)-D1036-F1036),NETWORKDAYS.INTL(C1036,E1036,1,JFERIES)-D1036-F1036))","v":0.5},"2016/01","",6.4600000000000009]
["LANGE Sébastien","2016-01-12","2016-08-08",0,"2016-08-26",0,"CP","Acceptée",{"$f":"IF(OR(G1037=\"Convention\",H1037=\"Refusée\"),0,IF(H1037=\"Annulée\",-(NETWORKDAYS.INTL(C1037,E1037,1,JFERIES)-D1037-F1037),NETWORKDAYS.INTL(C1037,E1037,1,JFERIES)-D1037-F1037))","v":14},"2016/08","CONGES ÉTÉ 2016",-16.91]
["HEMLER Christelle","2016-01-12","2016-01-14",0.5,"2016-01-14",0,"CP","Acceptée",{"$f":"IF(OR(G1038=\"Convention\",H1038=\"Refusée\"),0,IF(H1038=\"Annulée\",-(NETWORKDAYS.INTL(C1038,E1038,1,JFERIES)-D1038-F1038),NETWORKDAYS.INTL(C1038,E1038,1,JFERIES)-D1038-F1038))","v":0.5},"2016/01","",5.9600000000000009]
["COUTANT Jean Paul","2016-01-19","2016-02-26",0,"2016-02-26",0,"CP","Acceptée",{"$f":"IF(OR(G1039=\"Convention\",H1039=\"Refusée\"),0,IF(H1039=\"Annulée\",-(NETWORKDAYS.INTL(C1039,E1039,1,JFERIES)-D1039-F1039),NETWORKDAYS.INTL(C1039,E1039,1,JFERIES)-D1039-F1039))","v":1},"2016/02","",7.4600000000000009]
["LANGE Sébastien","2016-01-19","2015-12-18",0,"2015-12-18",0.5,"CP","Acceptée",{"$f":"IF(OR(G1040=\"Convention\",H1040=\"Refusée\"),0,IF(H1040=\"Annulée\",-(NETWORKDAYS.INTL(C1040,E1040,1,JFERIES)-D1040-F1040),NETWORKDAYS.INTL(C1040,E1040,1,JFERIES)-D1040-F1040))","v":0.5},"2015/12","",-3.41]
["LEDANT Charles","2016-01-20","2016-01-19",0,"2016-01-19",0,"CP","Acceptée",{"$f":"IF(OR(G1041=\"Convention\",H1041=\"Refusée\"),0,IF(H1041=\"Annulée\",-(NETWORKDAYS.INTL(C1041,E1041,1,JFERIES)-D1041-F1041),NETWORKDAYS.INTL(C1041,E1041,1,JFERIES)-D1041-F1041))","v":1},"2016/01","",4.9600000000000009]
["LEDANT Charles","2016-01-20","2016-05-06",0,"2016-05-06",0,"CP","Acceptée",{"$f":"IF(OR(G1042=\"Convention\",H1042=\"Refusée\"),0,IF(H1042=\"Annulée\",-(NETWORKDAYS.INTL(C1042,E1042,1,JFERIES)-D1042-F1042),NETWORKDAYS.INTL(C1042,E1042,1,JFERIES)-D1042-F1042))","v":1},"2016/05","",4.9600000000000009]
["TAQUET Alain","2016-01-21","2016-02-08",0,"2016-02-12",0,"CP","Acceptée",{"$f":"IF(OR(G1043=\"Convention\",H1043=\"Refusée\"),0,IF(H1043=\"Annulée\",-(NETWORKDAYS.INTL(C1043,E1043,1,JFERIES)-D1043-F1043),NETWORKDAYS.INTL(C1043,E1043,1,JFERIES)-D1043-F1043))","v":5},"2016/02","",4.9600000000000009]
["POMMERELL Patrick","2016-01-25","2016-03-04",0,"2016-03-04",0,"CP","Acceptée",{"$f":"IF(OR(G1044=\"Convention\",H1044=\"Refusée\"),0,IF(H1044=\"Annulée\",-(NETWORKDAYS.INTL(C1044,E1044,1,JFERIES)-D1044-F1044),NETWORKDAYS.INTL(C1044,E1044,1,JFERIES)-D1044-F1044))","v":1},"2016/03","",10.46]
["GIRAUDON Alain","2016-01-25","2016-04-04",0,"2016-04-08",0,"CP","Acceptée",{"$f":"IF(OR(G1045=\"Convention\",H1045=\"Refusée\"),0,IF(H1045=\"Annulée\",-(NETWORKDAYS.INTL(C1045,E1045,1,JFERIES)-D1045-F1045),NETWORKDAYS.INTL(C1045,E1045,1,JFERIES)-D1045-F1045))","v":5},"2016/04","",10.46]

{"sheet":"Personnel","index":5,"n_rows":35,"n_cols":29,"rows_kept":35,"cut":false,"hidden":false,"merged":[[0,15,0,16],[0,18,0,19]]}
["Nombre de jours/mois",2.08,null,null,null,null,"CP Période du",{"$f":"DATE(ANNEE_LSE,6,1)","v":"2015-06-01"},"au",{"$f":"DATE(ANNEE_LSE+1,5,31)","v":"2016-05-31"},null,{"$f":"(H1-F4)/365/5","v":3.4526027397260273},null,null,"RTT Période du","2015-01-01",null,"au","2015-12-31",null,null,null,null,null,"=ARRONDI.AU.MULTIPLE(Personnel!$M4*SOMME(Personnel!$N4:$Z4);0,5)",null,null,null,"2013-01-01"]
["TOTAUX",null,null,null,null,null,null,{"$f":"SUBTOTAL(9,Personnel!$H$4:$H$35)","v":-1.6999999999999993},{"$f":"SUBTOTAL(9,Personnel!$I$4:$I$35)","v":55},{"$f":"SUBTOTAL(9,Personnel!$J$4:$J$35)","v":780.74600000000021},null,{"$f":"SUBTOTAL(9,Personnel!$L$4:$L$35)","v":604}]
["Salarié","Sorti","User","Société","Agence","entrée","Coef","Solde N-1","ancienneté","Acquis N-1","Acquis N","Pris","RTT","RTT Solde N-1","Janv","Févr","Mars","Avril","Mai","Juin","Juillet","Aout","Sept","Oct","Nov","Déc","RTT Droits","RTT Pris","RTT Solde"]
["BEARZATTO Giovanni",null,"g.bearzatto","LSE","IDF","1998-03-01",1,1.5,{"$f":"IF(YEAR(PERSONNEL[[#This Row],[entrée]])=YEAR(CPdeb),0,MIN(4,INT((CPdeb-PERSONNEL[[#This Row],[entrée]])/365/5)))","v":3},{"$f":"$H4+$I4+IF($H$1-$F4<=0,0,IF($H$1-$F4>364,NbjCP*12*$G4,CEILING(($H$1-$F4)/30*$G4*NbjCP,0.01)))","v":29.46},{"$f":"IF($F4<$H$1,INT((TODAY()-$H$1)/30)*NbjCP*$G4,INT((TODAY()-$F4)/30)*NbjCP*$G4)","v":14.56},{"$f":"SUMIFS(Tabsaisies[NB jours],Tabsaisies[Salarié],Personnel!$A4,Tabsaisies[Nature],\"CP\",Tabsaisies[Statut],\"Acceptée\",Tabsaisies[Début],\">=\"&$H$1,Tabsaisies[Fin],\"<=\"&$J$1)","v":21},1,3,0.67,0.67,0.67,null,null,null,null,null,null,null,null,null,{"$f":"MROUND(Personnel!$M4*SUM(Personnel!$N4:$Z4),0.5)","v":5},{"$f":"SUMIFS(Tabsaisies[NB jours],Tabsaisies[Salarié],Personnel!$A4,Tabsaisies[Nature],\"RTT\",Tabsaisies[Statut],\"Acceptée\",Tabsaisies[Début],\">=\"&$P$1)","v":5},{"$f":"PERSONNEL[[#This Row],[RTT Droits]]-PERSONNEL[[#This Row],[RTT Pris]]","v":0}]
["BERTHE Magali",null,"m.berthe","LSE","SUD","2013-12-09",1,-8,{"$f":"IF(YEAR(PERSONNEL[[#This Row],[entrée]])=YEAR(CPdeb),0,MIN(4,INT((CPdeb-PERSONNEL[[#This Row],[entrée]])/365/5)))","v":0},16.96,14.56,{"$f":"SUMIFS(Tabsaisies[NB jours],Tabsaisies[Salarié],Personnel!$A5,Tabsaisies[Nature],\"CP\",Tabsaisies[Statut],\"Acceptée\",Tabsaisies[Début],\">=\"&$H$1,Tabsaisies[Fin],\"<=\"&$J$1)","v":16},0,0,0.67,0.67,0.67,null,null,null,null,null,null,null,null,null,{"$f":"MROUND(Personnel!$M5*SUM(Personnel!$N5:$Z5),0.5)","v":0},{"$f":"SUMIFS(Tabsaisies[NB jours],Tabsaisies[Salarié],Personnel!$A5,Tabsaisies[Nature],\"RTT\",Tabsaisies[Statut],\"Acceptée\",Tabsaisies[Début],\">=\"&$P$1)","v":0},{"$f":"PERSONNEL[[#This Row],[RTT Droits]]-PERSONNEL[[#This Row],[RTT Pris]]","v":0}]
["BABOULIN Marine",null,"m.baboulin","LSE","SUD","2015-10-22",1,null,{"$f":"IF(YEAR(PERSONNEL[[#This Row],[entrée]])=YEAR(CPdeb),0,MIN(4,INT((CPdeb-PERSONNEL[[#This Row],[entrée]])/365/5)))","v":0},0,6.24,{"$f":"SUMIFS(Tabsaisies[NB jours],Tabsaisies[Salarié],Personnel!$A6,Tabsaisies[Nature],\"CP\",Tabsaisies[Statut],\"Acceptée\",Tabsaisies[Début],\">=\"&$H$1,Tabsaisies[Fin],\"<=\"&$J$1)","v":0},0,0,null,null,null,null,null,null,null,null,null,null,null,null,{"$f":"MROUND(Personnel!$M6*SUM(Personnel!$N6:$Z6),0.5)","v":0},{"$f":"SUMIFS(Tabsaisies[NB jours],Tabsaisies[Salarié],Personnel!$A6,Tabsaisies[Nature],\"RTT\",Tabsaisies[Statut],\"Acceptée\",Tabsaisies[Début],\">=\"&$P$1)","v":0},{"$f":"PERSONNEL[[#This Row],[RTT Droits]]-PERSONNEL[[#This Row],[RTT Pris]]","v":0}]
["CHEVALIER Yohan",null,"y.chevalier","LSE","SUD","2014-02-12",1,-8.6999999999999993,{"$f":"IF(YEAR(PERSONNEL[[#This Row],[entrée]])=YEAR(CPdeb),0,MIN(4,INT((CPdeb-PERSONNEL[[#This Row],[entrée]])/365/5)))","v":0},16.260000000000002,14.56,{"$f":"SUMIFS(Tabsaisies[NB jours],Tabsaisies[Salarié],Personnel!$A7,Tabsaisies[Nature],\"CP\",Tabsaisies[Statut],\"Acceptée\",Tabsaisies[Début],\">=\"&$H$1,Tabsaisies[Fin],\"<=\"&$J$1)","v":21},0,0,0.67,0.67,0.67,null,null,null,null,null,null,null,null,null,{"$f":"MROUND(Personnel!$M7*SUM(Personnel!$N7:$Z7),0.5)","v":0},{"$f":"SUMIFS(Tabsaisies[NB jours],Tabsaisies[Salarié],Personnel!$A7,Tabsaisies[Nature],\"RTT\",Tabsaisies[Statut],\"Acceptée\",Tabsaisies[Début],\">=\"&$P$1)","v":0},{"$f":"PERSONNEL[[#This Row],[RTT Droits]]-PERSONNEL[[#This Row],[RTT Pris]]","v":0}]
["COUTANT Jean Paul",null,"jp.coutant","LSE","IDF","1994-01-01",1,6,{"$f":"IF(YEAR(PERSONNEL[[#This Row],[entrée]])=YEAR(CPdeb),0,MIN(4,INT((CPdeb-PERSONNEL[[#This Row],[entrée]])/365/5)))","v":4},34.96,14.56,{"$f":"SUMIFS(Tabsaisies[NB jours],Tabsaisies[Salarié],Personnel!$A8,Tabsaisies[Nature],\"CP\",Tabsaisies[Statut],\"Acceptée\",Tabsaisies[Début],\">=\"&$H$1,Tabsaisies[Fin],\"<=\"&$J$1)","v":27.5},1,2,0.67,0.67,0.67,null,null,null,null,null,null,null,null,null,{"$f":"MROUND(Personnel!$M8*SUM(Personnel!$N8:$Z8),0.5)","v":4},{"$f":"SUMIFS(Tabsaisies[NB jours],Tabsaisies[Salarié],Personnel!$A8,Tabsaisies[Nature],\"RTT\",Tabsaisies[Statut],\"Acceptée\",Tabsaisies[Début],\">=\"&$P$1)","v":4},{"$f":"PERSONNEL[[#This Row],[RTT Droits]]-PERSONNEL[[#This Row],[RTT Pris]]","v":0}]
["DEREPPE Bruno",null,"b.dereppe","LSE","IDF","1999-05-01",1,0,{"$f":"IF(YEAR(PERSONNEL[[#This Row],[entrée]])=YEAR(CPdeb),0,MIN(4,INT((CPdeb-PERSONNEL[[#This Row],[entrée]])/365/5)))","v":3},27.96,14.56,{"$f":"SUMIFS(Tabsaisies[NB jours],Tabsaisies[Salarié],Personnel!$A9,Tabsaisies[Nature],\"CP\",Tabsaisies[Statut],\"Acceptée\",Tabsaisies[Début],\">=\"&$H$1,Tabsaisies[Fin],\"<=\"&$J$1)","v":21},1,1.5,0.67,0.67,0.67,null,null,null,null,null,null,null,null,null,{"$f":"MROUND(Personnel!$M9*SUM(Personnel!$N9:$Z9),0.5)","v":3.5},{"$f":"SUMIFS(Tabsaisies[NB jours],Tabsaisies[Salarié],Personnel!$A9,Tabsaisies[Nature],\"RTT\",Tabsaisies[Statut],\"Acceptée\",Tabsaisies[Début],\">=\"&$P$1)","v":3},{"$f":"PERSONNEL[[#This Row],[RTT Droits]]-PERSONNEL[[#This Row],[RTT Pris]]","v":0.5}]
["DREVON Alain",null,"a.drevon","LSE","SUD","1997-01-01",1,0,{"$f":"IF(YEAR(PERSONNEL[[#This Row],[entrée]])=YEAR(CPdeb),0,MIN(4,INT((CPdeb-PERSONNEL[[#This Row],[entrée]])/365/5)))","v":3},27.96,14.56,{"$f":"SUMIFS(Tabsaisies[NB jours],Tabsaisies[Salarié],Personnel!$A10,Tabsaisies[Nature],\"CP\",Tabsaisies[Statut],\"Acceptée\",Tabsaisies[Début],\">=\"&$H$1,Tabsaisies[Fin],\"<=\"&$J$1)","v":23.5},1,2,0.67,0.67,0.67,null,null,null,null,null,null,null,null,null,{"$f":"MROUND(Personnel!$M10*SUM(Personnel!$N10:$Z10),0.5)","v":4},{"$f":"SUMIFS(Tabsaisies[NB jours],Tabsaisies[Salarié],Personnel!$A10,Tabsaisies[Nature],\"RTT\",Tabsaisies[Statut],\"Acceptée\",Tabsaisies[Début],\">=\"&$P$1)","v":4},{"$f":"PERSONNEL[[#This Row],[RTT Droits]]-PERSONNEL[[#This Row],[RTT Pris]]","v":0}]
["DREZET Olivier",null,"olivier.drezet","LSE","IDF","1995-10-01",1,3.5,{"$f":"IF(YEAR(PERSONNEL[[#This Row],[entrée]])=YEAR(CPdeb),0,MIN(4,INT((CPdeb-PERSONNEL[[#This Row],[entrée]])/365/5)))","v":3},31.46,14.56,{"$f":"SUMIFS(Tabsaisies[NB jours],Tabsaisies[Salarié],Personnel!$A11,Tabsaisies[Nature],\"CP\",Tabsaisies[Statut],\"Acceptée\",Tabsaisies[Début],\">=\"&$H$1,Tabsaisies[Fin],\"<=\"&$J$1)","v":26},1,2,0.67,0.67,0.67,null,null,null,null,null,null,null,null,null,{"$f":"MROUND(Personnel!$M11*SUM(Personnel!$N11:$Z11),0.5)","v":4},{"$f":"SUMIFS(Tabsaisies[NB jours],Tabsaisies[Salarié],Personnel!$A11,Tabsaisies[Nature],\"RTT\",Tabsaisies[Statut],\"Acceptée\",Tabsaisies[Début],\">=\"&$P$1)","v":4},{"$f":"PERSONNEL[[#This Row],[RTT Droits]]-PERSONNEL[[#This Row],[RTT Pris]]","v":0}]
["GIRAUDON Alain",null,"a.giraudon","LSE","IDF","2008-04-01",1,0,{"$f":"IF(YEAR(PERSONNEL[[#This Row],[entrée]])=YEAR(CPdeb),0,MIN(4,INT((CPdeb-PERSONNEL[[#This Row],[entrée]])/365/5)))","v":1},25.96,14.56,{"$f":"SUMIFS(Tabsaisies[NB jours],Tabsaisies[Salarié],Personnel!$A12,Tabsaisies[Nature],\"CP\",Tabsaisies[Statut],\"Acceptée\",Tabsaisies[Début],\">=\"&$H$1,Tabsaisies[Fin],\"<=\"&$J$1)","v":25.5},1,2.5,0.67,0.67,0.67,null,null,null,null,null,null,null,null,null,{"$f":"MROUND(Personnel!$M12*SUM(Personnel!$N12:$Z12),0.5)","v":4.5},{"$f":"SUMIFS(Tabsaisies[NB jours],Tabsaisies[Salarié],Personnel!$A12,Tabsaisies[Nature],\"RTT\",Tabsaisies[Statut],\"Acceptée\",Tabsaisies[Début],\">=\"&$P$1)","v":4.5},{"$f":"PERSONNEL[[#This Row],[RTT Droits]]-PERSONNEL[[#This Row],[RTT Pris]]","v":0}]
["GUERIN Viviane",null,"v.guerin","LSE","SUD","2005-03-01",1,6,{"$f":"IF(YEAR(PERSONNEL[[#This Row],[entrée]])=YEAR(CPdeb),0,MIN(4,INT((CPdeb-PERSONNEL[[#This Row],[entrée]])/365/5)))","v":2},32.96,14.56,{"$f":"SUMIFS(Tabsaisies[NB jours],Tabsaisies[Salarié],Personnel!$A13,Tabsaisies[Nature],\"CP\",Tabsaisies[Statut],\"Acceptée\",Tabsaisies[Début],\">=\"&$H$1,Tabsaisies[Fin],\"<=\"&$J$1)","v":23},1,3,0.67,0.67,0.67,null,null,null,null,null,null,null,null,null,{"$f":"MROUND(Personnel!$M13*SUM(Personnel!$N13:$Z13),0.5)","v":5},{"$f":"SUMIFS(Tabsaisies[NB jours],Tabsaisies[Salarié],Personnel!$A13,Tabsaisies[Nature],\"RTT\",Tabsaisies[Statut],\"Acceptée\",Tabsaisies[Début],\">=\"&$P$1)","v":5},{"$f":"PERSONNEL[[#This Row],[RTT Droits]]-PERSONNEL[[#This Row],[RTT Pris]]","v":0}]
["GUINOT Nathalie",null,"n.guinot","LSE","IDF","2010-09-01",1,0,{"$f":"IF(YEAR(PERSONNEL[[#This Row],[entrée]])=YEAR(CPdeb),0,MIN(4,INT((CPdeb-PERSONNEL[[#This Row],[entrée]])/365/5)))","v":0},24.96,14.56,{"$f":"SUMIFS(Tabsaisies[NB jours],Tabsaisies[Salarié],Personnel!$A14,Tabsaisies[Nature],\"CP\",Tabsaisies[Statut],\"Acceptée\",Tabsaisies[Début],\">=\"&$H$1,Tabsaisies[Fin],\"<=\"&$J$1)","v":20},1,3.5,0.67,0.67,0.67,null,null,null,null,null,null,null,null,null,{"$f":"MROUND(Personnel!$M14*SUM(Personnel!$N14:$Z14),0.5)","v":5.5},{"$f":"SUMIFS(Tabsaisies[NB jours],Tabsaisies[Salarié],Personnel!$A14,Tabsaisies[Nature],\"RTT\",Tabsaisies[Statut],\"Acceptée\",Tabsaisies[Début],\">=\"&$P$1)","v":5.5},{"$f":"PERSONNEL[[#This Row],[RTT Droits]]-PERSONNEL[[#This Row],[RTT Pris]]","v":0}]
["GUIOT Fabien",null,"f.guiot","LSE","IDF","2010-02-01",1,0,{"$f":"IF(YEAR(PERSONNEL[[#This Row],[entrée]])=YEAR(CPdeb),0,MIN(4,INT((CPdeb-PERSONNEL[[#This Row],[entrée]])/365/5)))","v":1},25.96,14.56,{"$f":"SUMIFS(Tabsaisies[NB jours],Tabsaisies[Salarié],Personnel!$A15,Tabsaisies[Nature],\"CP\",Tabsaisies[Statut],\"Acceptée\",Tabsaisies[Début],\">=\"&$H$1,Tabsaisies[Fin],\"<=\"&$J$1)","v":15.5},1,2,0.67,0.67,0.67,null,null,null,null,null,null,null,null,null,{"$f":"MROUND(Personnel!$M15*SUM(Personnel!$N15:$Z15),0.5)","v":4},{"$f":"SUMIFS(Tabsaisies[NB jours],Tabsaisies[Salarié],Personnel!$A15,Tabsaisies[Nature],\"RTT\",Tabsaisies[Statut],\"Acceptée\",Tabsaisies[Début],\">=\"&$P$1)","v":4},{"$f":"PERSONNEL[[#This Row],[RTT Droits]]-PERSONNEL[[#This Row],[RTT Pris]]","v":0}]
["HAUTEBRANC Alexis",null,"a.hautebranc","LSE","SUD","2005-06-01",1,1,{"$f":"IF(YEAR(PERSONNEL[[#This Row],[entrée]])=YEAR(CPdeb),0,MIN(4,INT((CPdeb-PERSONNEL[[#This Row],[entrée]])/365/5)))","v":2},27.96,14.56,{"$f":"SUMIFS(Tabsaisies[NB jours],Tabsaisies[Salarié],Personnel!$A16,Tabsaisies[Nature],\"CP\",Tabsaisies[Statut],\"Acceptée\",Tabsaisies[Début],\">=\"&$H$1,Tabsaisies[Fin],\"<=\"&$J$1)","v":24},1,2,0.67,0.67,0.67,null,null,null,null,null,null,null,null,null,{"$f":"MROUND(Personnel!$M16*SUM(Personnel!$N16:$Z16),0.5)","v":4},{"$f":"SUMIFS(Tabsaisies[NB jours],Tabsaisies[Salarié],Personnel!$A16,Tabsaisies[Nature],\"RTT\",Tabsaisies[Statut],\"Acceptée\",Tabsaisies[Début],\">=\"&$P$1)","v":4},{"$f":"PERSONNEL[[#This Row],[RTT Droits]]-PERSONNEL[[#This Row],[RTT Pris]]","v":0}]
["HEMLER Christelle",null,"c.hemler","LSE","IDF","2008-10-01",1,0.5,{"$f":"IF(YEAR(PERSONNEL[[#This Row],[entrée]])=YEAR(CPdeb),0,MIN(4,INT((CPdeb-PERSONNEL[[#This Row],[entrée]])/365/5)))","v":1},26.46,14.56,{"$f":"SUMIFS(Tabsaisies[NB jours],Tabsaisies[Salarié],Personnel!$A17,Tabsaisies[Nature],\"CP\",Tabsaisies[Statut],\"Acceptée\",Tabsaisies[Début],\">=\"&$H$1,Tabsaisies[Fin],\"<=\"&$J$1)","v":20.5},1,2,0.67,0.67,0.67,null,null,null,null,null,null,null,null,null,{"$f":"MROUND(Personnel!$M17*SUM(Personnel!$N17:$Z17),0.5)","v":4},{"$f":"SUMIFS(Tabsaisies[NB jours],Tabsaisies[Salarié],Personnel!$A17,Tabsaisies[Nature],\"RTT\",Tabsaisies[Statut],\"Acceptée\",Tabsaisies[Début],\">=\"&$P$1)","v":4},{"$f":"PERSONNEL[[#This Row],[RTT Droits]]-PERSONNEL[[#This Row],[RTT Pris]]","v":0}]
["KADEM Christophe",null,"c.kadem","LSE","NO","2007-11-01",1,1,{"$f":"IF(YEAR(PERSONNEL[[#This Row],[entrée]])=YEAR(CPdeb),0,MIN(4,INT((CPdeb-PERSONNEL[[#This Row],[entrée]])/365/5)))","v":1},26.96,14.56,{"$f":"SUMIFS(Tabsaisies[NB jours],Tabsaisies[Salarié],Personnel!$A18,Tabsaisies[Nature],\"CP\",Tabsaisies[Statut],\"Acceptée\",Tabsaisies[Début],\">=\"&$H$1,Tabsaisies[Fin],\"<=\"&$J$1)","v":21},1,1,0.67,0.67,0.67,null,null,null,null,null,null,null,null,null,{"$f":"MROUND(Personnel!$M18*SUM(Personnel!$N18:$Z18),0.5)","v":3},{"$f":"SUMIFS(Tabsaisies[NB jours],Tabsaisies[Salarié],Personnel!$A18,Tabsaisies[Nature],\"RTT\",Tabsaisies[Statut],\"Acceptée\",Tabsaisies[Début],\">=\"&$P$1)","v":3},{"$f":"PERSONNEL[[#This Row],[RTT Droits]]-PERSONNEL[[#This Row],[RTT Pris]]","v":0}]
["KOSCIELNY Philippe",null,"p.koscielny","LSE ","IDF","2015-07-01",1,null,{"$f":"IF(YEAR(PERSONNEL[[#This Row],[entrée]])=YEAR(CPdeb),0,MIN(4,INT((CPdeb-PERSONNEL[[#This Row],[entrée]])/365/5)))","v":0},0,12.48,{"$f":"SUMIFS(Tabsaisies[NB jours],Tabsaisies[Salarié],Personnel!$A19,Tabsaisies[Nature],\"CP\",Tabsaisies[Statut],\"Acceptée\",Tabsaisies[Début],\">=\"&$H$1,Tabsaisies[Fin],\"<=\"&$J$1)","v":7},null,null,null,null,null,null,null,null,null,null,null,null,null,null,{"$f":"MROUND(Personnel!$M19*SUM(Personnel!$N19:$Z19),0.5)","v":0},{"$f":"SUMIFS(Tabsaisies[NB jours],Tabsaisies[Salarié],Personnel!$A19,Tabsaisies[Nature],\"RTT\",Tabsaisies[Statut],\"Acceptée\",Tabsaisies[Début],\">=\"&$P$1)","v":0},{"$f":"PERSONNEL[[#This Row],[RTT Droits]]-PERSONNEL[[#This Row],[RTT Pris]]","v":0}]
["LANGE Sébastien",null,"s.lange","LSE","SUD","2014-11-17",1,-1.5,{"$f":"IF(YEAR(PERSONNEL[[#This Row],[entrée]])=YEAR(CPdeb),0,MIN(4,INT((CPdeb-PERSONNEL[[#This Row],[entrée]])/365/5)))","v":0},12.09,14.56,{"$f":"SUMIFS(Tabsaisies[NB jours],Tabsaisies[Salarié],Personnel!$A20,Tabsaisies[Nature],\"CP\",Tabsaisies[Statut],\"Acceptée\",Tabsaisies[Début],\">=\"&$H$1,Tabsaisies[Fin],\"<=\"&$J$1)","v":15.5},0,null,0.67,0.67,0.67,null,null,null,null,null,null,null,null,null,{"$f":"MROUND(Personnel!$M20*SUM(Personnel!$N20:$Z20),0.5)","v":0},{"$f":"SUMIFS(Tabsaisies[NB jours],Tabsaisies[Salarié],Personnel!$A20,Tabsaisies[Nature],\"RTT\",Tabsaisies[Statut],\"Acceptée\",Tabsaisies[Début],\">=\"&$P$1)","v":0},{"$f":"PERSONNEL[[#This Row],[RTT Droits]]-PERSONNEL[[#This Row],[RTT Pris]]","v":0}]
["LEDANT Charles",null,"c.ledant","LSE","SUD","1983-11-01",1,0,{"$f":"IF(YEAR(PERSONNEL[[#This Row],[entrée]])=YEAR(CPdeb),0,MIN(4,INT((CPdeb-PERSONNEL[[#This Row],[entrée]])/365/5)))","v":4},28.96,14.56,{"$f":"SUMIFS(Tabsaisies[NB jours],Tabsaisies[Salarié],Personnel!$A21,Tabsaisies[Nature],\"CP\",Tabsaisies[Statut],\"Acceptée\",Tabsaisies[Début],\">=\"&$H$1,Tabsaisies[Fin],\"<=\"&$J$1)","v":25},1,2,0.67,0.67,0.67,null,null,null,null,null,null,null,null,null,{"$f":"MROUND(Personnel!$M21*SUM(Personnel!$N21:$Z21),0.5)","v":4},{"$f":"SUMIFS(Tabsaisies[NB jours],Tabsaisies[Salarié],Personnel!$A21,Tabsaisies[Nature],\"RTT\",Tabsaisies[Statut],\"Acceptée\",Tabsaisies[Début],\">=\"&$P$1)","v":4},{"$f":"PERSONNEL[[#This Row],[RTT Droits]]-PERSONNEL[[#This Row],[RTT Pris]]","v":0}]
["LOCATELLI Bruno",null,"b.locatelli","LSE","SUD","1989-08-01",1,0,{"$f":"IF(YEAR(PERSONNEL[[#This Row],[entrée]])=YEAR(CPdeb),0,MIN(4,INT((CPdeb-PERSONNEL[[#This Row],[entrée]])/365/5)))","v":4},28.96,14.56,{"$f":"SUMIFS(Tabsaisies[NB jours],Tabsaisies[Salarié],Personnel!$A22,Tabsaisies[Nature],\"CP\",Tabsaisies[Statut],\"Acceptée\",Tabsaisies[Début],\">=\"&$H$1,Tabsaisies[Fin],\"<=\"&$J$1)","v":29.5},1,3,0.67,0.67,0.67,null,null,null,null,null,null,null,null,null,{"$f":"MROUND(Personnel!$M22*SUM(Personnel!$N22:$Z22),0.5)","v":5},{"$f":"SUMIFS(Tabsaisies[NB jours],Tabsaisies[Salarié],Personnel!$A22,Tabsaisies[Nature],\"RTT\",Tabsaisies[Statut],\"Acceptée\",Tabsaisies[Début],\">=\"&$P$1)","v":5},{"$f":"PERSONNEL[[#This Row],[RTT Droits]]-PERSONNEL[[#This Row],[RTT Pris]]","v":0}]
["LOYER Michel",null,"m.loyer","LSE","NO","2006-12-01",1,0,{"$f":"IF(YEAR(PERSONNEL[[#This Row],[entrée]])=YEAR(CPdeb),0,MIN(4,INT((CPdeb-PERSONNEL[[#This Row],[entrée]])/365/5)))","v":1},25.96,14.56,{"$f":"SUMIFS(Tabsaisies[NB jours],Tabsaisies[Salarié],Personnel!$A23,Tabsaisies[Nature],\"CP\",Tabsaisies[Statut],\"Acceptée\",Tabsaisies[Début],\">=\"&$H$1,Tabsaisies[Fin],\"<=\"&$J$1)","v":24},1,2,0.67,0.67,0.67,null,null,null,null,null,null,null,null,null,{"$f":"MROUND(Personnel!$M23*SUM(Personnel!$N23:$Z23),0.5)","v":4},{"$f":"SUMIFS(Tabsaisies[NB jours],Tabsaisies[Salarié],Personnel!$A23,Tabsaisies[Nature],\"RTT\",Tabsaisies[Statut],\"Acceptée\",Tabsaisies[Début],\">=\"&$P$1)","v":4},{"$f":"PERSONNEL[[#This Row],[RTT Droits]]-PERSONNEL[[#This Row],[RTT Pris]]","v":0}]
["MARAIS Bernard",null,"b.marais","OBI","SUD","1985-08-01",1,-2,{"$f":"IF(YEAR(PERSONNEL[[#This Row],[entrée]])=YEAR(CPdeb),0,MIN(4,INT((CPdeb-PERSONNEL[[#This Row],[entrée]])/365/5)))","v":4},26.96,14.56,{"$f":"SUMIFS(Tabsaisies[NB jours],Tabsaisies[Salarié],Personnel!$A24,Tabsaisies[Nature],\"CP\",Tabsaisies[Statut],\"Acceptée\",Tabsaisies[Début],\">=\"&$H$1,Tabsaisies[Fin],\"<=\"&$J$1)","v":27},0,0,0.67,0.67,0.67,null,null,null,null,null,null,null,null,null,{"$f":"MROUND(Personnel!$M24*SUM(Personnel!$N24:$Z24),0.5)","v":0},{"$f":"SUMIFS(Tabsaisies[NB jours],Tabsaisies[Salarié],Personnel!$A24,Tabsaisies[Nature],\"RTT\",Tabsaisies[Statut],\"Acceptée\",Tabsaisies[Début],\">=\"&$P$1)","v":0},{"$f":"PERSONNEL[[#This Row],[RTT Droits]]-PERSONNEL[[#This Row],[RTT Pris]]","v":0}]
["MINAKIAN Mathilde",null,"m.minakian","LSE","SUD","2013-10-18",1,-5.5,{"$f":"IF(YEAR(PERSONNEL[[#This Row],[entrée]])=YEAR(CPdeb),0,MIN(4,INT((CPdeb-PERSONNEL[[#This Row],[entrée]])/365/5)))","v":0},19.46,14.56,{"$f":"SUMIFS(Tabsaisies[NB jours],Tabsaisies[Salarié],Personnel!$A25,Tabsaisies[Nature],\"CP\",Tabsaisies[Statut],\"Acceptée\",Tabsaisies[Début],\">=\"&$H$1,Tabsaisies[Fin],\"<=\"&$J$1)","v":23.5},null,null,0.67,0.67,0.67,null,null,null,null,null,null,null,null,null,{"$f":"MROUND(Personnel!$M25*SUM(Personnel!$N25:$Z25),0.5)","v":0},{"$f":"SUMIFS(Tabsaisies[NB jours],Tabsaisies[Salarié],Personnel!$A25,Tabsaisies[Nature],\"RTT\",Tabsaisies[Statut],\"Acceptée\",Tabsaisies[Début],\">=\"&$P$1)","v":0},{"$f":"PERSONNEL[[#This Row],[RTT Droits]]-PERSONNEL[[#This Row],[RTT Pris]]","v":0}]
["MARZOUK Sami",null,"s.marzouk","LSE","IDF","1981-10-01",1,0,{"$f":"IF(YEAR(PERSONNEL[[#This Row],[entrée]])=YEAR(CPdeb),0,MIN(4,INT((CPdeb-PERSONNEL[[#This Row],[entrée]])/365/5)))","v":4},28.96,14.56,{"$f":"SUMIFS(Tabsaisies[NB jours],Tabsaisies[Salarié],Personnel!$A26,Tabsaisies[Nature],\"CP\",Tabsaisies[Statut],\"Acceptée\",Tabsaisies[Début],\">=\"&$H$1,Tabsaisies[Fin],\"<=\"&$J$1)","v":22},1,1,0.67,0.67,0.67,null,null,null,null,null,null,null,null,null,{"$f":"MROUND(Personnel!$M26*SUM(Personnel!$N26:$Z26),0.5)","v":3},{"$f":"SUMIFS(Tabsaisies[NB jours],Tabsaisies[Salarié],Personnel!$A26,Tabsaisies[Nature],\"RTT\",Tabsaisies[Statut],\"Acceptée\",Tabsaisies[Début],\">=\"&$P$1)","v":2.5},{"$f":"PERSONNEL[[#This Row],[RTT Droits]]-PERSONNEL[[#This Row],[RTT Pris]]","v":0.5}]
["PLONQUET Christian",null,"p.plonquet","LSE","NO","2012-10-01",{"$f":"1*3/5","v":0.6},-6.5,{"$f":"IF(YEAR(PERSONNEL[[#This Row],[entrée]])=YEAR(CPdeb),0,MIN(4,INT((CPdeb-PERSONNEL[[#This Row],[entrée]])/365/5)))","v":0},8.4759999999999991,8.7360000000000007,{"$f":"SUMIFS(Tabsaisies[NB jours],Tabsaisies[Salarié],Personnel!$A27,Tabsaisies[Nature],\"CP\",Tabsaisies[Statut],\"Acceptée\",Tabsaisies[Début],\">=\"&$H$1,Tabsaisies[Fin],\"<=\"&$J$1)","v":0},0,0,0.67,0.67,0.67,null,null,null,null,null,null,null,null,null,{"$f":"MROUND(Personnel!$M27*SUM(Personnel!$N27:$Z27),0.5)","v":0},{"$f":"SUMIFS(Tabsaisies[NB jours],Tabsaisies[Salarié],Personnel!$A27,Tabsaisies[Nature],\"RTT\",Tabsaisies[Statut],\"Acceptée\",Tabsaisies[Début],\">=\"&$P$1)","v":0},{"$f":"PERSONNEL[[#This Row],[RTT Droits]]-PERSONNEL[[#This Row],[RTT Pris]]","v":0}]
["POMMERELL Patrick",null,"p.pommerell","LSE","IDF","1989-10-01",1,7.5,{"$f":"IF(YEAR(PERSONNEL[[#This Row],[entrée]])=YEAR(CPdeb),0,MIN(4,INT((CPdeb-PERSONNEL[[#This Row],[entrée]])/365/5)))","v":4},36.46,14.56,{"$f":"SUMIFS(Tabsaisies[NB jours],Tabsaisies[Salarié],Personnel!$A28,Tabsaisies[Nature],\"CP\",Tabsaisies[Statut],\"Acceptée\",Tabsaisies[Début],\">=\"&$H$1,Tabsaisies[Fin],\"<=\"&$J$1)","v":26},1,2.5,0.67,0.67,0.67,null,null,null,null,null,null,null,null,null,{"$f":"MROUND(Personnel!$M28*SUM(Personnel!$N28:$Z28),0.5)","v":4.5},{"$f":"SUMIFS(Tabsaisies[NB jours],Tabsaisies[Salarié],Personnel!$A28,Tabsaisies[Nature],\"RTT\",Tabsaisies[Statut],\"Acceptée\",Tabsaisies[Début],\">=\"&$P$1)","v":4.5},{"$f":"PERSONNEL[[#This Row],[RTT Droits]]-PERSONNEL[[#This Row],[RTT Pris]]","v":0}]
["PONS Olivier",null,"o.pons","LSE","SUD","2010-09-01",1,1,{"$f":"IF(YEAR(PERSONNEL[[#This Row],[entrée]])=YEAR(CPdeb),0,MIN(4,INT((CPdeb-PERSONNEL[[#This Row],[entrée]])/365/5)))","v":0},25.96,14.56,{"$f":"SUMIFS(Tabsaisies[NB jours],Tabsaisies[Salarié],Personnel!$A29,Tabsaisies[Nature],\"CP\",Tabsaisies[Statut],\"Acceptée\",Tabsaisies[Début],\">=\"&$H$1,Tabsaisies[Fin],\"<=\"&$J$1)","v":17.5},1,4,0.67,0.67,0.67,null,null,null,null,null,null,null,null,null,{"$f":"MROUND(Personnel!$M29*SUM(Personnel!$N29:$Z29),0.5)","v":6},{"$f":"SUMIFS(Tabsaisies[NB jours],Tabsaisies[Salarié],Personnel!$A29,Tabsaisies[Nature],\"RTT\",Tabsaisies[Statut],\"Acceptée\",Tabsaisies[Début],\">=\"&$P$1)","v":5},{"$f":"PERSONNEL[[#This Row],[RTT Droits]]-PERSONNEL[[#This Row],[RTT Pris]]","v":1}]
["ROBIN Kevin",null,"k.robin","LSE","IDF","2012-11-01",1,null,{"$f":"IF(YEAR(PERSONNEL[[#This Row],[entrée]])=YEAR(CPdeb),0,MIN(4,INT((CPdeb-PERSONNEL[[#This Row],[entrée]])/365/5)))","v":0},24.96,14.56,{"$f":"SUMIFS(Tabsaisies[NB jours],Tabsaisies[Salarié],Personnel!$A30,Tabsaisies[Nature],\"CP\",Tabsaisies[Statut],\"Acceptée\",Tabsaisies[Début],\">=\"&$H$1,Tabsaisies[Fin],\"<=\"&$J$1)","v":0},null,0,0.67,0.67,0.67,null,null,null,null,null,null,null,null,null,{"$f":"MROUND(Personnel!$M30*SUM(Personnel!$N30:$Z30),0.5)","v":0},{"$f":"SUMIFS(Tabsaisies[NB jours],Tabsaisies[Salarié],Personnel!$A30,Tabsaisies[Nature],\"RTT\",Tabsaisies[Statut],\"Acceptée\",Tabsaisies[Début],\">=\"&$P$1)","v":0},{"$f":"PERSONNEL[[#This Row],[RTT Droits]]-PERSONNEL[[#This Row],[RTT Pris]]","v":0}]
["RUBIO Isabel",null,"i.rubio","SOCAGI","IDF","2008-01-01",1,null,{"$f":"IF(YEAR(PERSONNEL[[#This Row],[entrée]])=YEAR(CPdeb),0,MIN(4,INT((CPdeb-PERSONNEL[[#This Row],[entrée]])/365/5)))","v":1},25.96,14.56,{"$f":"SUMIFS(Tabsaisies[NB jours],Tabsaisies[Salarié],Personnel!$A31,Tabsaisies[Nature],\"CP\",Tabsaisies[Statut],\"Acceptée\",Tabsaisies[Début],\">=\"&$H$1,Tabsaisies[Fin],\"<=\"&$J$1)","v":0},1,0,0.67,0.67,0.67,null,null,null,null,null,null,null,null,null,{"$f":"MROUND(Personnel!$M31*SUM(Personnel!$N31:$Z31),0.5)","v":2},{"$f":"SUMIFS(Tabsaisies[NB jours],Tabsaisies[Salarié],Personnel!$A31,Tabsaisies[Nature],\"RTT\",Tabsaisies[Statut],\"Acceptée\",Tabsaisies[Début],\">=\"&$P$1)","v":0},{"$f":"PERSONNEL[[#This Row],[RTT Droits]]-PERSONNEL[[#This Row],[RTT Pris]]","v":2}]
["SANTUCCI Lionel",null,"l.santucci","LSE","SUD","1992-05-01",1,0,{"$f":"IF(YEAR(PERSONNEL[[#This Row],[entrée]])=YEAR(CPdeb),0,MIN(4,INT((CPdeb-PERSONNEL[[#This Row],[entrée]])/365/5)))","v":4},28.96,14.56,{"$f":"SUMIFS(Tabsaisies[NB jours],Tabsaisies[Salarié],Personnel!$A32,Tabsaisies[Nature],\"CP\",Tabsaisies[Statut],\"Acceptée\",Tabsaisies[Début],\">=\"&$H$1,Tabsaisies[Fin],\"<=\"&$J$1)","v":23},1,2,0.67,0.67,0.67,null,null,null,null,null,null,null,null,null,{"$f":"MROUND(Personnel!$M32*SUM(Personnel!$N32:$Z32),0.5)","v":4},{"$f":"SUMIFS(Tabsaisies[NB jours],Tabsaisies[Salarié],Personnel!$A32,Tabsaisies[Nature],\"RTT\",Tabsaisies[Statut],\"Acceptée\",Tabsaisies[Début],\">=\"&$P$1)","v":4},{"$f":"PERSONNEL[[#This Row],[RTT Droits]]-PERSONNEL[[#This Row],[RTT Pris]]","v":0}]
["SOUCHET Alain",null,"a.souchet","LSE","IDF","1991-01-01",1,1,{"$f":"IF(YEAR(PERSONNEL[[#This Row],[entrée]])=YEAR(CPdeb),0,MIN(4,INT((CPdeb-PERSONNEL[[#This Row],[entrée]])/365/5)))","v":4},29.96,14.56,{"$f":"SUMIFS(Tabsaisies[NB jours],Tabsaisies[Salarié],Personnel!$A33,Tabsaisies[Nature],\"CP\",Tabsaisies[Statut],\"Acceptée\",Tabsaisies[Début],\">=\"&$H$1,Tabsaisies[Fin],\"<=\"&$J$1)","v":17},1,1.5,0.67,0.67,0.67,null,null,null,null,null,null,null,null,null,{"$f":"MROUND(Personnel!$M33*SUM(Personnel!$N33:$Z33),0.5)","v":3.5},{"$f":"SUMIFS(Tabsaisies[NB jours],Tabsaisies[Salarié],Personnel!$A33,Tabsaisies[Nature],\"RTT\",Tabsaisies[Statut],\"Acceptée\",Tabsaisies[Début],\">=\"&$P$1)","v":2},{"$f":"PERSONNEL[[#This Row],[RTT Droits]]-PERSONNEL[[#This Row],[RTT Pris]]","v":1.5}]
["TAQUET Alain",null,"a.taquet","LSE","NO","2006-12-01",1,1.5,{"$f":"IF(YEAR(PERSONNEL[[#This Row],[entrée]])=YEAR(CPdeb),0,MIN(4,INT((CPdeb-PERSONNEL[[#This Row],[entrée]])/365/5)))","v":1},27.46,14.56,{"$f":"SUMIFS(Tabsaisies[NB jours],Tabsaisies[Salarié],Personnel!$A34,Tabsaisies[Nature],\"CP\",Tabsaisies[Statut],\"Acceptée\",Tabsaisies[Début],\">=\"&$H$1,Tabsaisies[Fin],\"<=\"&$J$1)","v":22.5},1,4,0.67,0.67,0.67,null,null,null,null,null,null,null,null,null,{"$f":"MROUND(Personnel!$M34*SUM(Personnel!$N34:$Z34),0.5)","v":6},{"$f":"SUMIFS(Tabsaisies[NB jours],Tabsaisies[Salarié],Personnel!$A34,Tabsaisies[Nature],\"RTT\",Tabsaisies[Statut],\"Acceptée\",Tabsaisies[Début],\">=\"&$P$1)","v":6},{"$f":"PERSONNEL[[#This Row],[RTT Droits]]-PERSONNEL[[#This Row],[RTT Pris]]","v":0}]
["VAUTRAIN Franck",null,"f.vautrain","LSE","SUD","2011-06-01",1,0,{"$f":"IF(YEAR(PERSONNEL[[#This Row],[entrée]])=YEAR(CPdeb),0,MIN(4,INT((CPdeb-PERSONNEL[[#This Row],[entrée]])/365/5)))","v":0},24.96,14.56,{"$f":"SUMIFS(Tabsaisies[NB jours],Tabsaisies[Salarié],Personnel!$A35,Tabsaisies[Nature],\"CP\",Tabsaisies[Statut],\"Acceptée\",Tabsaisies[Début],\">=\"&$H$1,Tabsaisies[Fin],\"<=\"&$J$1)","v":19},1,4,0.67,0.67,0.67,null,null,null,null,null,null,null,null,null,{"$f":"MROUND(Personnel!$M35*SUM(Personnel!$N35:$Z35),0.5)","v":6},{"$f":"SUMIFS(Tabsaisies[NB jours],Tabsaisies[Salarié],Personnel!$A35,Tabsaisies[Nature],\"RTT\",Tabsaisies[Statut],\"Acceptée\",Tabsaisies[Début],\">=\"&$P$1)","v":5},{"$f":"PERSONNEL[[#This Row],[RTT Droits]]-PERSONNEL[[#This Row],[RTT Pris]]","v":1}]

{"sheet":"Feuil1","index":6,"n_rows":40,"n_cols":14,"rows_kept":40,"cut":false,"hidden":false,"merged":[]}
[]
[]
[]
["Nature","CP"]
[]
["Somme de NB jours","mois"]
[null,"2014",null,null,null,null,null,null,"2015",null,null,null,null,"Total général"]
["Étiquettes de lignes","juin","juil","août","sept","oct","nov","déc","janv","févr","mars","avr","mai"]
["BEARZATTO Giovanni",null,1,10,6,null,null,null,null,6,2,null,1,26]
["BERTHE Magali",null,null,9,null,null,1.5,null,1,null,null,null,1,12.5]
["CHEVALIER Yohan",null,4,5,null,null,null,0,null,null,null,null,2,11]
["COUTANT Jean Paul",1,null,15,null,null,null,null,null,null,1,5,1,23]
["DEREPPE Bruno",null,4,10,5,null,null,null,null,null,5,null,4,28]
["DREVON Alain",null,4,6,5,null,null,null,null,5,null,null,5.5,25.5]
["DREZET Olivier",1,null,16,4,null,1,1,null,null,null,4,1,28]
["GIRAUDON Alain",1,null,20,null,null,null,null,null,null,5,null,null,26]
["GUERIN Viviane",1,1,17,1,null,null,0,null,null,null,null,5,25]
["GUINOT Nathalie",null,null,15,null,null,null,null,null,5,null,2,3,25]
["GUIOT Fabien",null,null,15,null,null,null,1,null,null,null,4,5,25]
["HAUTEBRANC Alexis",null,4,6,5,1,null,0.5,null,null,2.5,null,6,25]
["HEMLER Christelle",null,4,6,5,null,null,0.5,null,null,2,2,6,25.5]
["KADEM Christophe",null,null,15,null,null,null,1,null,null,5,null,4.5,25.5]
["LANGE Sébastien",null,null,null,null,null,null,null,1,null,null,null,0.5,1.5]
["LAZZARO Fabien",null,4,11,null,null,null,null,null,null,null,null,null,15]
["LEDANT Charles",null,null,17,null,null,1,null,2,null,3,1,5,29]
["LOCATELLI Bruno",null,null,5,11,null,null,null,null,null,5,1,5,27]
["LOYER Michel",1,7,10,1,1,null,1,null,null,2,null,3,26]
["MARAIS Bernard",null,null,9,10,null,null,1,1,5,null,null,1,27]
["MARZOUK Sami",null,null,20,null,null,null,1,null,null,null,8,null,29]
["MINAKIAN Mathilde",null,1,15,null,null,1,null,1,null,null,null,null,18]
["PLONQUET Christian",null,null,17,5,0,2,null,null,null,null,null,null,24]
["POMMERELL Patrick",null,null,15,null,null,null,null,null,2,null,4,0,21]
["PONS Olivier",null,5,10,null,null,null,null,null,7,null,null,null,22]
["ROBIN Kevin",null,1,15,null,null,1,1.5,1,2,1,1.5,null,24]
["SANTUCCI Lionel",null,null,15,1,null,null,1,null,null,2,3,8,30]
["SIODMAK Eric",null,null,14,2,null,null,1,null,5,0,4,null,26]
["SOUCHET Alain",null,null,20,null,null,null,null,null,null,null,2.5,7,29.5]
["TAQUET Alain",2,null,14,1,null,null,null,null,null,4,null,5.5,26.5]
["VAUTRAIN Franck",null,null,15,null,null,null,0,null,null,null,5,5,25]
["Total général",7,40,387,62,2,7.5,10.5,7,37,39.5,47,85,731.5]